{"text_format":"1","workbook":"xlsx","n_sheets":13,"sheets":["Life-Cycle Cost Analysis","LinkedData","Site Specific Savings","General Savings","AdditionalInformation","Site_based calculation","General_savings Calculations","MeasureTable","Lifetime","Lists","Site-specific Lists","sample-llc","Cost of Electricity"],"not_rendered":{"charts":1,"images":3,"macros":1,"external_links":0,"defined_names":17,"comments":2,"pivot_tables":0},"unopened":[],"bounds":{"document_bytes":16777216,"sheet_cells":100000,"rows_first":2000,"rows_last":500,"rows_between":2000,"halvings":0,"cell_chars":16384,"cell_head_chars":4096},"cells_cut":0,"cells_raw":0,"read":"whole","date_system":"1900"}

{"sheet":"Life-Cycle Cost Analysis","index":0,"n_rows":69,"n_cols":27,"rows_kept":69,"cut":false,"hidden":false,"merged":[[68,26,70,28],[68,18,70,25],[6,1,8,16],[67,18,67,19],[3,1,4,13],[3,14,4,16],[63,26,64,28],[65,26,66,28],[62,18,62,19],[66,18,66,19],[65,18,65,19],[64,18,64,19],[63,18,63,19],[63,20,64,25],[62,20,62,25],[66,20,67,25],[65,20,65,25],[62,26,62,28],[67,26,67,28]]}
[null,null,null,null,null,"ER Life Cycle Cost Calculator, Efficient Pumping Systems"]
[]
[]
[null,"This workbook calculates the difference in Life Cycle Costs associated with purchasing and installing efficient pumping systems, when compared to an installation with a lower Energy Rating (ER).",null,null,null,null,null,null,null,null,null,null,null,null,"Version 1.0.0"]
[]
[]
[null,"Traditionally, LCC Analysis looks at the total cost and total benefit of different scenarios which serve the needed purpose. This workbook presents the incremental difference in cost and benefit between different efficient pumping scenarios compared to an average pump."]
[]
[]
[null,null,null,null,null,null,null,null,null,null,null,null,null,null,null,null,null,null,"How to use the calculator tabs:"]
[]
[null,null,null,null,null,null,null,null,null,null,null,null,null,null,null,null,null,null,"Enter NECESSARY information in the Yellow cells on each calculator tab"]
[null,null,null,null,null,null,null,null,null,null,null,null,null,null,null,null,null,null,"Enter any additional OPTIONAL information you want to include in the calculation in the blue cells. "]
[]
[]
[]
[]
[]
[]
[]
[]
[]
[]
[]
[]
[]
[]
[]
[null,null,null,null,null,null,null,"From","Subject","Received","Size","Categories"]
[null,null,null,null,null,null,null,"Ray Hartwell","Re: Hydraulic Institute LCC Calculator FOR REVIEW","Thu 6:55 PM","77 KB"]
[]
[]
[]
[null,null,null,null,null,"Maintenance Cost",123]
[null,null,null,null,null,"Initial Cost",37]
[null,null,null,null,null,"Energy Cost",163]
[null,null,null,null,null,"Other Costs",37]
[]
[]
[]
[]
[]
[]
[]
[]
[]
[null,"For more information on the data sources for this calculator:"]
[null,"1.","https://rtf.nwcouncil.org/measure/efficient-pumps"]
[null,"2.","http://er.pumps.org/ratings/search"]
[null,"3.","https://estore.pumps.org/Pump-Life-Cycle-Costs-A-Guide-to-LCC-Analysis-for-Pumping-Systems-P35C13.aspx"]
[]
[]
[]
[]
[]
[]
[]
[]
[]
[]
[]
[]
[null,null,null,null,null,null,null,null,null,null,null,null,null,null,null,null,null,null,"Variable",null,"Source of information",null,null,null,null,null,"Link to Source (hyperlinks direct to source)"]
[null,null,null,null,null,null,null,null,null,null,null,null,null,null,null,null,null,null,"Operating Hours",null,"Based on research conducted in the Pacific Northwest to characterize pump operation and installation",null,null,null,null,null,"neea.org"]
[null,null,null,null,null,null,null,null,null,null,null,null,null,null,null,null,null,null,"Load Profile"]
[null,null,null,null,null,null,null,null,null,null,null,null,null,null,null,null,null,null,"Pump Lifetime",null,"Department of Energy Rulemaking Process for Clean Water Pumps",null,null,null,null,null,"regulation.gov"]
[null,null,null,null,null,null,null,null,null,null,null,null,null,null,null,null,null,null,"Motor Oversizing",null,"Based on the Regional Technical Forum’s Efficient Pump UES Measures",null,null,null,null,null,"rtf.nwcouncil.org"]
[null,null,null,null,null,null,null,null,null,null,null,null,null,null,null,null,null,null,"Incremental Cost Increase"]
[null,null,null,null,null,null,null,null,null,null,null,null,null,null,null,null,null,null,"More information on the simplified energy equation is presented in HI's Deemed Measure List and Technical Resources Manual (TRM)",null,null,null,null,null,null,null,"http://www.pumps.org/Utility_Resources.aspx "]

{"sheet":"LinkedData","index":1,"n_rows":622,"n_cols":7,"rows_kept":622,"cut":false,"hidden":true,"merged":[]}
["speed","rated motor power","doe","max er","Column1","_1","_2"]
["constant",1,"ESCC",17,"","",""]
["constant",1,"ESFM",3,"","",""]
["constant",1,"IL",15,"","",""]
["constant",1,"RSV",17,"","",""]
["constant",1,"ST","-","","",""]
["constant",1.5,"ESCC",28,"","",""]
["constant",1.5,"ESFM",30,"","",""]
["constant",1.5,"IL",20,"","",""]
["constant",1.5,"RSV",12,"","",""]
["constant",1.5,"ST",12,"","",""]
["constant",2,"ESCC",22,"","",""]
["constant",2,"ESFM",22,"","",""]
["constant",2,"IL",21,"","",""]
["constant",2,"RSV",13,"","",""]
["constant",2,"ST",13,"","",""]
["constant",3,"ESCC",48,"","",""]
["constant",3,"ESFM",48,"","",""]
["constant",3,"IL",18,"","",""]
["constant",3,"RSV",18,"","",""]
["constant",3,"ST",25,"","",""]
["constant",5,"ESCC",18,"","",""]
["constant",5,"ESFM",20,"","",""]
["constant",5,"IL",20,"","",""]
["constant",5,"RSV",10,"","",""]
["constant",5,"ST",16,"","",""]
["constant",7.5,"ESCC",18,"","",""]
["constant",7.5,"ESFM",19,"","",""]
["constant",7.5,"IL",20,"","",""]
["constant",7.5,"RSV",15,"","",""]
["constant",7.5,"ST",14,"","",""]
["constant",10,"ESCC",26,"","",""]
["constant",10,"ESFM",15,"","",""]
["constant",10,"IL",21,"","",""]
["constant",10,"RSV",6,"","",""]
["constant",10,"ST",15,"","",""]
["constant",15,"ESCC",25,"","",""]
["constant",15,"ESFM",25,"","",""]
["constant",15,"IL",20,"","",""]
["constant",15,"RSV",13,"","",""]
["constant",15,"ST",18,"","",""]
["constant",20,"ESCC",20,"","",""]
["constant",20,"ESFM",20,"","",""]
["constant",20,"IL",19,"","",""]
["constant",20,"RSV",9,"","",""]
["constant",20,"ST",9,"","",""]
["constant",25,"ESCC",18,"","",""]
["constant",25,"ESFM",19,"","",""]
["constant",25,"IL",12,"","",""]
["constant",25,"RSV",12,"","",""]
["constant",25,"ST",10,"","",""]
["constant",30,"ESCC",13,"","",""]
["constant",30,"ESFM",13,"","",""]
["constant",30,"IL",20,"","",""]
["constant",30,"RSV","-","","",""]
["constant",30,"ST",8,"","",""]
["constant",40,"ESCC",21,"","",""]
["constant",40,"ESFM",20,"","",""]
["constant",40,"IL",26,"","",""]
["constant",40,"RSV",18,"","",""]
["constant",40,"ST",9,"","",""]
["constant",50,"ESCC",17,"","",""]
["constant",50,"ESFM",18,"","",""]
["constant",50,"IL",19,"","",""]
["constant",50,"RSV",7,"","",""]
["constant",50,"ST",10,"","",""]
["constant",60,"ESCC",17,"","",""]
["constant",60,"ESFM",16,"","",""]
["constant",60,"IL",15,"","",""]
["constant",60,"RSV",8,"","",""]
["constant",60,"ST",12,"","",""]
["constant",75,"ESCC",16,"","",""]
["constant",75,"ESFM",13,"","",""]
["constant",75,"IL",16,"","",""]
["constant",75,"RSV",8,"","",""]
["constant",75,"ST",19,"","",""]
["constant",100,"ESCC",10,"","",""]
["constant",100,"ESFM",45,"","",""]
["constant",100,"IL",13,"","",""]
["constant",100,"RSV",8,"","",""]
["constant",100,"ST","-","","",""]
["constant",125,"ESCC",7,"","",""]
["constant",125,"ESFM",8,"","",""]
["constant",125,"IL",12,"","",""]
["constant",125,"RSV",7,"","",""]
["constant",125,"ST","-","","",""]
["constant",150,"ESCC",8,"","",""]
["constant",150,"ESFM",8,"","",""]
["constant",150,"IL",13,"","",""]
["constant",150,"RSV","-","","",""]
["constant",150,"ST","-","","",""]
["constant",200,"ESCC",9,"","",""]
["constant",200,"ESFM",9,"","",""]
["constant",200,"IL",8,"","",""]
["constant",200,"RSV","-","","",""]
["constant",200,"ST","-","","",""]
["constant",250,"ESCC",5,"","",""]
["constant",250,"ESFM",6,"","",""]
["constant",250,"IL",5,"","",""]
["constant",250,"RSV","-","","",""]
["constant",250,"ST","-","","",""]
["variable",1,"ESCC",52,"","",""]
["variable",1,"ESFM",49,"","",""]
["variable",1,"IL",62,"","",""]
["variable",1,"RSV",59,"","",""]
["variable",1,"ST","-","","",""]
["variable",1.5,"ESCC",52,"","",""]
["variable",1.5,"ESFM",48,"","",""]
["variable",1.5,"IL",64,"","",""]
["variable",1.5,"RSV",59,"","",""]
["variable",1.5,"ST",46,"","",""]
["variable",2,"ESCC",57,"","",""]
["variable",2,"ESFM",59,"","",""]
["variable",2,"IL",64,"","",""]
["variable",2,"RSV",62,"","",""]
["variable",2,"ST",46,"","",""]
["variable",3,"ESCC",57,"","",""]
["variable",3,"ESFM",59,"","",""]
["variable",3,"IL",64,"","",""]
["variable",3,"RSV",60,"","",""]
["variable",3,"ST",51,"","",""]
["variable",5,"ESCC",57,"","",""]
["variable",5,"ESFM",62,"","",""]
["variable",5,"IL",58,"","",""]
["variable",5,"RSV",55,"","",""]
["variable",5,"ST",46,"","",""]
["variable",7.5,"ESCC",58,"","",""]
["variable",7.5,"ESFM",62,"","",""]
["variable",7.5,"IL",59,"","",""]
["variable",7.5,"RSV",60,"","",""]
["variable",7.5,"ST",42,"","",""]
["variable",10,"ESCC",56,"","",""]
["variable",10,"ESFM",64,"","",""]
["variable",10,"IL",59,"","",""]
["variable",10,"RSV",56,"","",""]
["variable",10,"ST",48,"","",""]
["variable",15,"ESCC",60,"","",""]
["variable",15,"ESFM",62,"","",""]
["variable",15,"IL",61,"","",""]
["variable",15,"RSV",60,"","",""]
["variable",15,"ST",45,"","",""]
["variable",20,"ESCC",56,"","",""]
["variable",20,"ESFM",57,"","",""]
["variable",20,"IL",59,"","",""]
["variable",20,"RSV",54,"","",""]
["variable",20,"ST",44,"","",""]
["variable",25,"ESCC",58,"","",""]
["variable",25,"ESFM",59,"","",""]
["variable",25,"IL",56,"","",""]
["variable",25,"RSV",56,"","",""]
["variable",25,"ST",45,"","",""]
["variable",30,"ESCC",56,"","",""]
["variable",30,"ESFM",57,"","",""]
["variable",30,"IL",60,"","",""]
["variable",30,"RSV","-","","",""]
["variable",30,"ST",46,"","",""]
["variable",40,"ESCC",59,"","",""]
["variable",40,"ESFM",59,"","",""]
["variable",40,"IL",60,"","",""]
["variable",40,"RSV",55,"","",""]
["variable",40,"ST",47,"","",""]
["variable",50,"ESCC",58,"","",""]
["variable",50,"ESFM",59,"","",""]
["variable",50,"IL",59,"","",""]
["variable",50,"RSV",55,"","",""]
["variable",50,"ST","-","","",""]
["variable",60,"ESCC",55,"","",""]
["variable",60,"ESFM",56,"","",""]
["variable",60,"IL",57,"","",""]
["variable",60,"RSV","-","","",""]
["variable",60,"ST","-","","",""]
["variable",75,"ESCC",55,"","",""]
["variable",75,"ESFM",55,"","",""]
["variable",75,"IL",57,"","",""]
["variable",75,"RSV",41,"","",""]
["variable",75,"ST","-","","",""]
["variable",100,"ESCC",54,"","",""]
["variable",100,"ESFM",54,"","",""]
["variable",100,"IL",56,"","",""]
["variable",100,"RSV",42,"","",""]
["variable",100,"ST","-","","",""]
["variable",125,"ESCC",54,"","",""]
["variable",125,"ESFM",54,"","",""]
["variable",125,"IL",56,"","",""]
["variable",125,"RSV","-","","",""]
["variable",125,"ST","-","","",""]
["variable",150,"ESCC",53,"","",""]
["variable",150,"ESFM",54,"","",""]
["variable",150,"IL",56,"","",""]
["variable",150,"RSV","-","","",""]
["variable",150,"ST","-","","",""]
["variable",200,"ESCC",56,"","",""]
["variable",200,"ESFM",56,"","",""]
["variable",200,"IL",54,"","",""]
["variable",200,"RSV","-","","",""]
["variable",200,"ST","-","","",""]
["variable",250,"ESCC","-","","",""]
["variable",250,"ESFM","-","","",""]
["variable",250,"IL",53,"","",""]
["variable",250,"RSV","-","","",""]
["variable",250,"ST","-","","",""]
["configuration",null,"flow","head","min er","avg er","max er"]
["bare",null,"0-50","0-50","-","-","-"]
["bare",null,"0-50","50-100",1,7,14]
["bare",null,"0-50","100+",4,14,24]
["bare",null,"50-100","0-50",1,7,17]
["bare",null,"50-100","50-100",1,8,18]
["bare",null,"50-100","100+",2,12,26]
["bare",null,"100-150","0-50",0,6,15]
["bare",null,"100-150","50-100",1,10,17]
["bare",null,"100-150","100+",-5,12,25]
["bare",null,"150-200","0-50",0,7,13]
["bare",null,"150-200","50-100",2,6,13]
["bare",null,"150-200","100+",0,11,21]
["bare",null,"200-300","0-50",2,5,8]
["bare",null,"200-300","50-100",0,9,14]
["bare",null,"200-300","100+",1,10,20]
["bare",null,"300-800","0-50",0,6,10]
["bare",null,"300-800","50-100",1,6,10]
["bare",null,"300-800","100+",0,7,18]
["bare",null,"800+","0-50","-","-","-"]
["bare",null,"800+","50-100",2,5,11]
["bare",null,"800+","100+",0,4,12]
["bare",null,"0-50","0-50","-","-","-"]
["bare",null,"0-50","50-100",2,9,15]
["bare",null,"0-50","100+",6,16,21]
["bare",null,"50-100","0-50",2,8,22]
["bare",null,"50-100","50-100",1,11,29]
["bare",null,"50-100","100+",1,12,19]
["bare",null,"100-150","0-50",0,8,14]
["bare",null,"100-150","50-100",1,10,17]
["bare",null,"100-150","100+",1,11,25]
["bare",null,"150-200","0-50",1,8,16]
["bare",null,"150-200","50-100",1,6,14]
["bare",null,"150-200","100+",0,10,20]
["bare",null,"200-300","0-50",2,6,11]
["bare",null,"200-300","50-100",1,7,15]
["bare",null,"200-300","100+",2,10,20]
["bare",null,"300-800","0-50",1,6,11]
["bare",null,"300-800","50-100",2,5,11]
["bare",null,"300-800","100+",0,7,19]
["bare",null,"800+","0-50","-","-","-"]
["bare",null,"800+","50-100",0,4,11]
["bare",null,"800+","100+",0,4,13]
["bare",null,"0-50","0-50","-","-","-"]
["bare",null,"0-50","50-100","-","-","-"]
["bare",null,"0-50","100+","-","-","-"]
["bare",null,"50-100","0-50",2,10,15]
["bare",null,"50-100","50-100",1,14,20]
["bare",null,"50-100","100+",16,17,19]
["bare",null,"100-150","0-50",1,8,13]
["bare",null,"100-150","50-100",7,12,15]
["bare",null,"100-150","100+",12,15,20]
["bare",null,"150-200","0-50",3,8,9]
["bare",null,"150-200","50-100",2,7,12]
["bare",null,"150-200","100+",7,15,26]
["bare",null,"200-300","0-50",3,6,11]
["bare",null,"200-300","50-100",6,9,14]
["bare",null,"200-300","100+",2,9,15]
["bare",null,"300-800","0-50",3,5,8]
["bare",null,"300-800","50-100",3,6,11]
["bare",null,"300-800","100+",1,7,15]
["bare",null,"800+","0-50","-","-","-"]
["bare",null,"800+","50-100",1,3,5]
["bare",null,"800+","100+",1,5,13]
["bare",null,"0-50","0-50","-","-","-"]
["bare",null,"0-50","50-100",6,13,15]
["bare",null,"0-50","100+",8,10,13]
["bare",null,"50-100","0-50","-","-","-"]
["bare",null,"50-100","50-100",5,8,10]
["bare",null,"50-100","100+",4,16,18]
["bare",null,"100-150","0-50","-","-","-"]
["bare",null,"100-150","50-100",9,10,12]
["bare",null,"100-150","100+",4,9,12]
["bare",null,"150-200","0-50","-","-","-"]
["bare",null,"150-200","50-100",2,5,6]
["bare",null,"150-200","100+",9,12,13]
["bare",null,"200-300","0-50","-","-","-"]
["bare",null,"200-300","50-100",1,3,6]
["bare",null,"200-300","100+",6,11,12]
["bare",null,"300-800","0-50","-","-","-"]
["bare",null,"300-800","50-100",6,6,6]
["bare",null,"300-800","100+",2,6,18]
["bare",null,"800+","0-50","-","-","-"]
["bare",null,"800+","50-100","-","-","-"]
["bare",null,"800+","100+","-","-","-"]
["bare",null,"0-50","0-50","-","-","-"]
["bare",null,"0-50","50-100","-","-","-"]
["bare",null,"0-50","100+",7,20,25]
["bare",null,"50-100","0-50","-","-","-"]
["bare",null,"50-100","50-100","-","-","-"]
["bare",null,"50-100","100+",2,8,18]
["bare",null,"100-150","0-50","-","-","-"]
["bare",null,"100-150","50-100",3,3,3]
["bare",null,"100-150","100+",3,5,6]
["bare",null,"150-200","0-50","-","-","-"]
["bare",null,"150-200","50-100","-","-","-"]
["bare",null,"150-200","100+",0,4,10]
["bare",null,"200-300","0-50",3,3,3]
["bare",null,"200-300","50-100","-","-","-"]
["bare",null,"200-300","100+",3,8,9]
["bare",null,"300-800","0-50","-","-","-"]
["bare",null,"300-800","50-100","-","-","-"]
["bare",null,"300-800","100+",6,8,12]
["bare",null,"800+","0-50","-","-","-"]
["bare",null,"800+","50-100","-","-","-"]
["bare",null,"800+","100+","-","-","-"]
["pump_motor",null,"0-50","0-50","-","-","-"]
["pump_motor",null,"0-50","50-100",8,11,19]
["pump_motor",null,"0-50","100+",4,14,24]
["pump_motor",null,"50-100","0-50",0,7,17]
["pump_motor",null,"50-100","50-100",0,11,28]
["pump_motor",null,"50-100","100+",1,10,17]
["pump_motor",null,"100-150","0-50",1,8,15]
["pump_motor",null,"100-150","50-100",1,10,17]
["pump_motor",null,"100-150","100+",1,12,25]
["pump_motor",null,"150-200","0-50",1,7,14]
["pump_motor",null,"150-200","50-100",1,9,17]
["pump_motor",null,"150-200","100+",0,9,19]
["pump_motor",null,"200-300","0-50",2,7,10]
["pump_motor",null,"200-300","50-100",-4,7,16]
["pump_motor",null,"200-300","100+",1,9,17]
["pump_motor",null,"300-800","0-50",0,6,11]
["pump_motor",null,"300-800","50-100",1,5,10]
["pump_motor",null,"300-800","100+",0,7,18]
["pump_motor",null,"800+","0-50",1,1,1]
["pump_motor",null,"800+","50-100",0,4,8]
["pump_motor",null,"800+","100+",0,4,9]
["pump_motor",null,"0-50","0-50","-","-","-"]
["pump_motor",null,"0-50","50-100",15,15,15]
["pump_motor",null,"0-50","100+",6,16,21]
["pump_motor",null,"50-100","0-50",2,7,12]
["pump_motor",null,"50-100","50-100",1,9,30]
["pump_motor",null,"50-100","100+",1,12,18]
["pump_motor",null,"100-150","0-50",2,8,14]
["pump_motor",null,"100-150","50-100",2,13,20]
["pump_motor",null,"100-150","100+",1,12,25]
["pump_motor",null,"150-200","0-50",1,8,16]
["pump_motor",null,"150-200","50-100",1,12,16]
["pump_motor",null,"150-200","100+",0,9,20]
["pump_motor",null,"200-300","0-50",3,7,11]
["pump_motor",null,"200-300","50-100",1,7,15]
["pump_motor",null,"200-300","100+",1,9,18]
["pump_motor",null,"300-800","0-50",1,5,11]
["pump_motor",null,"300-800","50-100",1,4,11]
["pump_motor",null,"300-800","100+",0,7,19]
["pump_motor",null,"800+","0-50",2,2,2]
["pump_motor",null,"800+","50-100",0,3,9]
["pump_motor",null,"800+","100+",0,4,10]
["pump_motor",null,"0-50","0-50","-","-","-"]
["pump_motor",null,"0-50","50-100","-","-","-"]
["pump_motor",null,"0-50","100+","-","-","-"]
["pump_motor",null,"50-100","0-50",1,7,20]
["pump_motor",null,"50-100","50-100",1,12,21]
["pump_motor",null,"50-100","100+",4,9,17]
["pump_motor",null,"100-150","0-50",1,9,15]
["pump_motor",null,"100-150","50-100",0,7,18]
["pump_motor",null,"100-150","100+",4,14,21]
["pump_motor",null,"150-200","0-50",1,6,15]
["pump_motor",null,"150-200","50-100",2,10,20]
["pump_motor",null,"150-200","100+",2,9,26]
["pump_motor",null,"200-300","0-50",3,5,11]
["pump_motor",null,"200-300","50-100",1,6,14]
["pump_motor",null,"200-300","100+",0,7,19]
["pump_motor",null,"300-800","0-50",0,4,10]
["pump_motor",null,"300-800","50-100",0,4,11]
["pump_motor",null,"300-800","100+",0,7,20]
["pump_motor",null,"800+","0-50",4,4,4]
["pump_motor",null,"800+","50-100",0,2,7]
["pump_motor",null,"800+","100+",0,4,13]
["pump_motor",null,"0-50","0-50","-","-","-"]
["pump_motor",null,"0-50","50-100",6,12,17]
["pump_motor",null,"0-50","100+",9,9,9]
["pump_motor",null,"50-100","0-50",1,1,1]
["pump_motor",null,"50-100","50-100",5,7,9]
["pump_motor",null,"50-100","100+",6,10,14]
["pump_motor",null,"100-150","0-50","-","-","-"]
["pump_motor",null,"100-150","50-100",9,11,12]
["pump_motor",null,"100-150","100+",1,5,10]
["pump_motor",null,"150-200","0-50","-","-","-"]
["pump_motor",null,"150-200","50-100",2,4,6]
["pump_motor",null,"150-200","100+",9,11,13]
["pump_motor",null,"200-300","0-50","-","-","-"]
["pump_motor",null,"200-300","50-100",1,3,6]
["pump_motor",null,"200-300","100+",7,10,12]
["pump_motor",null,"300-800","0-50","-","-","-"]
["pump_motor",null,"300-800","50-100",6,6,6]
["pump_motor",null,"300-800","100+",2,5,8]
["pump_motor",null,"800+","0-50","-","-","-"]
["pump_motor",null,"800+","50-100","-","-","-"]
["pump_motor",null,"800+","100+","-","-","-"]
["pump_motor",null,"0-50","0-50","-","-","-"]
["pump_motor",null,"0-50","50-100","-","-","-"]
["pump_motor",null,"0-50","100+",7,11,16]
["pump_motor",null,"50-100","0-50","-","-","-"]
["pump_motor",null,"50-100","50-100","-","-","-"]
["pump_motor",null,"50-100","100+",5,8,15]
["pump_motor",null,"100-150","0-50","-","-","-"]
["pump_motor",null,"100-150","50-100","-","-","-"]
["pump_motor",null,"100-150","100+",3,3,3]
["pump_motor",null,"150-200","0-50","-","-","-"]
["pump_motor",null,"150-200","50-100","-","-","-"]
["pump_motor",null,"150-200","100+",3,6,9]
["pump_motor",null,"200-300","0-50","-","-","-"]
["pump_motor",null,"200-300","50-100","-","-","-"]
["pump_motor",null,"200-300","100+",3,6,8]
["pump_motor",null,"300-800","0-50","-","-","-"]
["pump_motor",null,"300-800","50-100","-","-","-"]
["pump_motor",null,"300-800","100+",5,13,19]
["pump_motor",null,"800+","0-50","-","-","-"]
["pump_motor",null,"800+","50-100","-","-","-"]
["pump_motor",null,"800+","100+","-","-","-"]
["pump_motor_cc",null,"0-50","0-50","-","-","-"]
["pump_motor_cc",null,"0-50","50-100",55,55,55]
["pump_motor_cc",null,"0-50","100+",48,54,57]
["pump_motor_cc",null,"50-100","0-50",39,47,52]
["pump_motor_cc",null,"50-100","50-100",49,53,57]
["pump_motor_cc",null,"50-100","100+",47,51,55]
["pump_motor_cc",null,"100-150","0-50",47,50,53]
["pump_motor_cc",null,"100-150","50-100",47,52,57]
["pump_motor_cc",null,"100-150","100+",49,54,60]
["pump_motor_cc",null,"150-200","0-50",43,49,55]
["pump_motor_cc",null,"150-200","50-100",47,51,56]
["pump_motor_cc",null,"150-200","100+",47,53,59]
["pump_motor_cc",null,"200-300","0-50",47,50,54]
["pump_motor_cc",null,"200-300","50-100",42,54,57]
["pump_motor_cc",null,"200-300","100+",49,54,58]
["pump_motor_cc",null,"300-800","0-50",48,53,55]
["pump_motor_cc",null,"300-800","50-100",51,53,55]
["pump_motor_cc",null,"300-800","100+",49,53,57]
["pump_motor_cc",null,"800+","0-50","-","-","-"]
["pump_motor_cc",null,"800+","50-100",51,54,55]
["pump_motor_cc",null,"800+","100+",48,52,56]
["pump_motor_cc",null,"0-50","0-50",34,34,34]
["pump_motor_cc",null,"0-50","50-100",56,56,56]
["pump_motor_cc",null,"0-50","100+",57,57,57]
["pump_motor_cc",null,"50-100","0-50",39,46,52]
["pump_motor_cc",null,"50-100","50-100",48,55,59]
["pump_motor_cc",null,"50-100","100+",44,50,56]
["pump_motor_cc",null,"100-150","0-50",41,50,54]
["pump_motor_cc",null,"100-150","50-100",47,55,62]
["pump_motor_cc",null,"100-150","100+",49,58,64]
["pump_motor_cc",null,"150-200","0-50",43,53,59]
["pump_motor_cc",null,"150-200","50-100",48,57,62]
["pump_motor_cc",null,"150-200","100+",47,55,62]
["pump_motor_cc",null,"200-300","0-50",47,53,59]
["pump_motor_cc",null,"200-300","50-100",50,57,60]
["pump_motor_cc",null,"200-300","100+",47,55,61]
["pump_motor_cc",null,"300-800","0-50",48,54,59]
["pump_motor_cc",null,"300-800","50-100",51,54,57]
["pump_motor_cc",null,"300-800","100+",49,52,57]
["pump_motor_cc",null,"800+","0-50","-","-","-"]
["pump_motor_cc",null,"800+","50-100",50,53,56]
["pump_motor_cc",null,"800+","100+",45,52,56]
["pump_motor_cc",null,"0-50","0-50","-","-","-"]
["pump_motor_cc",null,"0-50","50-100","-","-","-"]
["pump_motor_cc",null,"0-50","100+","-","-","-"]
["pump_motor_cc",null,"50-100","0-50",38,48,61]
["pump_motor_cc",null,"50-100","50-100",46,51,59]
["pump_motor_cc",null,"50-100","100+",50,51,54]
["pump_motor_cc",null,"100-150","0-50",44,58,64]
["pump_motor_cc",null,"100-150","50-100",48,51,58]
["pump_motor_cc",null,"100-150","100+",49,54,61]
["pump_motor_cc",null,"150-200","0-50",48,50,56]
["pump_motor_cc",null,"150-200","50-100",47,55,59]
["pump_motor_cc",null,"150-200","100+",49,53,60]
["pump_motor_cc",null,"200-300","0-50",46,56,64]
["pump_motor_cc",null,"200-300","50-100",44,53,58]
["pump_motor_cc",null,"200-300","100+",49,53,59]
["pump_motor_cc",null,"300-800","0-50",43,50,57]
["pump_motor_cc",null,"300-800","50-100",50,52,57]
["pump_motor_cc",null,"300-800","100+",48,52,60]
["pump_motor_cc",null,"800+","0-50",53,53,53]
["pump_motor_cc",null,"800+","50-100",50,52,54]
["pump_motor_cc",null,"800+","100+",49,52,56]
["pump_motor_cc",null,"0-50","0-50",57,57,57]
["pump_motor_cc",null,"0-50","50-100",46,55,61]
["pump_motor_cc",null,"0-50","100+",50,58,59]
["pump_motor_cc",null,"50-100","0-50",50,57,59]
["pump_motor_cc",null,"50-100","50-100",49,57,62]
["pump_motor_cc",null,"50-100","100+",50,57,60]
["pump_motor_cc",null,"100-150","0-50","-","-","-"]
["pump_motor_cc",null,"100-150","50-100",53,54,54]
["pump_motor_cc",null,"100-150","100+",51,56,59]
["pump_motor_cc",null,"150-200","0-50","-","-","-"]
["pump_motor_cc",null,"150-200","50-100",50,52,55]
["pump_motor_cc",null,"150-200","100+",54,58,60]
["pump_motor_cc",null,"200-300","0-50","-","-","-"]
["pump_motor_cc",null,"200-300","50-100",50,55,59]
["pump_motor_cc",null,"200-300","100+",54,56,60]
["pump_motor_cc",null,"300-800","0-50","-","-","-"]
["pump_motor_cc",null,"300-800","50-100",53,57,58]
["pump_motor_cc",null,"300-800","100+",41,51,57]
["pump_motor_cc",null,"800+","0-50","-","-","-"]
["pump_motor_cc",null,"800+","50-100","-","-","-"]
["pump_motor_cc",null,"800+","100+","-","-","-"]
["pump_motor_cc",null,"0-50","0-50","-","-","-"]
["pump_motor_cc",null,"0-50","50-100","-","-","-"]
["pump_motor_cc",null,"0-50","100+",41,46,51]
["pump_motor_cc",null,"50-100","0-50","-","-","-"]
["pump_motor_cc",null,"50-100","50-100","-","-","-"]
["pump_motor_cc",null,"50-100","100+",42,44,48]
["pump_motor_cc",null,"100-150","0-50","-","-","-"]
["pump_motor_cc",null,"100-150","50-100","-","-","-"]
["pump_motor_cc",null,"100-150","100+",42,42,42]
["pump_motor_cc",null,"150-200","0-50","-","-","-"]
["pump_motor_cc",null,"150-200","50-100","-","-","-"]
["pump_motor_cc",null,"150-200","100+",42,44,45]
["pump_motor_cc",null,"200-300","0-50","-","-","-"]
["pump_motor_cc",null,"200-300","50-100","-","-","-"]
["pump_motor_cc",null,"200-300","100+",44,45,46]
["pump_motor_cc",null,"300-800","0-50","-","-","-"]
["pump_motor_cc",null,"300-800","50-100","-","-","-"]
["pump_motor_cc",null,"300-800","100+",46,47,47]
["pump_motor_cc",null,"800+","0-50","-","-","-"]
["pump_motor_cc",null,"800+","50-100","-","-","-"]
["pump_motor_cc",null,"800+","100+","-","-","-"]
["pump_motor_nc",null,"0-50","0-50","-","-","-"]
["pump_motor_nc",null,"0-50","50-100","-","-","-"]
["pump_motor_nc",null,"0-50","100+",48,48,48]
["pump_motor_nc",null,"50-100","0-50","-","-","-"]
["pump_motor_nc",null,"50-100","50-100","-","-","-"]
["pump_motor_nc",null,"50-100","100+","-","-","-"]
["pump_motor_nc",null,"100-150","0-50","-","-","-"]
["pump_motor_nc",null,"100-150","50-100","-","-","-"]
["pump_motor_nc",null,"100-150","100+","-","-","-"]
["pump_motor_nc",null,"150-200","0-50","-","-","-"]
["pump_motor_nc",null,"150-200","50-100","-","-","-"]
["pump_motor_nc",null,"150-200","100+","-","-","-"]
["pump_motor_nc",null,"200-300","0-50","-","-","-"]
["pump_motor_nc",null,"200-300","50-100","-","-","-"]
["pump_motor_nc",null,"200-300","100+","-","-","-"]
["pump_motor_nc",null,"300-800","0-50","-","-","-"]
["pump_motor_nc",null,"300-800","50-100","-","-","-"]
["pump_motor_nc",null,"300-800","100+","-","-","-"]
["pump_motor_nc",null,"800+","0-50","-","-","-"]
["pump_motor_nc",null,"800+","50-100","-","-","-"]
["pump_motor_nc",null,"800+","100+","-","-","-"]
["pump_motor_nc",null,"0-50","0-50","-","-","-"]
["pump_motor_nc",null,"0-50","50-100","-","-","-"]
["pump_motor_nc",null,"0-50","100+",48,48,48]
["pump_motor_nc",null,"50-100","0-50","-","-","-"]
["pump_motor_nc",null,"50-100","50-100","-","-","-"]
["pump_motor_nc",null,"50-100","100+","-","-","-"]
["pump_motor_nc",null,"100-150","0-50","-","-","-"]
["pump_motor_nc",null,"100-150","50-100","-","-","-"]
["pump_motor_nc",null,"100-150","100+","-","-","-"]
["pump_motor_nc",null,"150-200","0-50","-","-","-"]
["pump_motor_nc",null,"150-200","50-100","-","-","-"]
["pump_motor_nc",null,"150-200","100+","-","-","-"]
["pump_motor_nc",null,"200-300","0-50","-","-","-"]
["pump_motor_nc",null,"200-300","50-100","-","-","-"]
["pump_motor_nc",null,"200-300","100+","-","-","-"]
["pump_motor_nc",null,"300-800","0-50","-","-","-"]
["pump_motor_nc",null,"300-800","50-100","-","-","-"]
["pump_motor_nc",null,"300-800","100+","-","-","-"]
["pump_motor_nc",null,"800+","0-50","-","-","-"]
["pump_motor_nc",null,"800+","50-100","-","-","-"]
["pump_motor_nc",null,"800+","100+",45,45,45]
["pump_motor_nc",null,"0-50","0-50","-","-","-"]
["pump_motor_nc",null,"0-50","50-100","-","-","-"]
["pump_motor_nc",null,"0-50","100+","-","-","-"]
["pump_motor_nc",null,"50-100","0-50","-","-","-"]
["pump_motor_nc",null,"50-100","50-100","-","-","-"]
["pump_motor_nc",null,"50-100","100+","-","-","-"]
["pump_motor_nc",null,"100-150","0-50","-","-","-"]
["pump_motor_nc",null,"100-150","50-100","-","-","-"]
["pump_motor_nc",null,"100-150","100+","-","-","-"]
["pump_motor_nc",null,"150-200","0-50","-","-","-"]
["pump_motor_nc",null,"150-200","50-100","-","-","-"]
["pump_motor_nc",null,"150-200","100+","-","-","-"]
["pump_motor_nc",null,"200-300","0-50","-","-","-"]
["pump_motor_nc",null,"200-300","50-100","-","-","-"]
["pump_motor_nc",null,"200-300","100+","-","-","-"]
["pump_motor_nc",null,"300-800","0-50","-","-","-"]
["pump_motor_nc",null,"300-800","50-100","-","-","-"]
["pump_motor_nc",null,"300-800","100+","-","-","-"]
["pump_motor_nc",null,"800+","0-50","-","-","-"]
["pump_motor_nc",null,"800+","50-100","-","-","-"]
["pump_motor_nc",null,"800+","100+","-","-","-"]
["pump_motor_nc",null,"0-50","0-50","-","-","-"]
["pump_motor_nc",null,"0-50","50-100","-","-","-"]
["pump_motor_nc",null,"0-50","100+","-","-","-"]
["pump_motor_nc",null,"50-100","0-50","-","-","-"]
["pump_motor_nc",null,"50-100","50-100","-","-","-"]
["pump_motor_nc",null,"50-100","100+","-","-","-"]
["pump_motor_nc",null,"100-150","0-50","-","-","-"]
["pump_motor_nc",null,"100-150","50-100","-","-","-"]
["pump_motor_nc",null,"100-150","100+","-","-","-"]
["pump_motor_nc",null,"150-200","0-50","-","-","-"]
["pump_motor_nc",null,"150-200","50-100","-","-","-"]
["pump_motor_nc",null,"150-200","100+","-","-","-"]
["pump_motor_nc",null,"200-300","0-50","-","-","-"]
["pump_motor_nc",null,"200-300","50-100","-","-","-"]
["pump_motor_nc",null,"200-300","100+","-","-","-"]
["pump_motor_nc",null,"300-800","0-50","-","-","-"]
["pump_motor_nc",null,"300-800","50-100","-","-","-"]
["pump_motor_nc",null,"300-800","100+","-","-","-"]
["pump_motor_nc",null,"800+","0-50","-","-","-"]
["pump_motor_nc",null,"800+","50-100","-","-","-"]
["pump_motor_nc",null,"800+","100+","-","-","-"]
["pump_motor_nc",null,"0-50","0-50","-","-","-"]
["pump_motor_nc",null,"0-50","50-100","-","-","-"]
["pump_motor_nc",null,"0-50","100+","-","-","-"]
["pump_motor_nc",null,"50-100","0-50","-","-","-"]
["pump_motor_nc",null,"50-100","50-100","-","-","-"]
["pump_motor_nc",null,"50-100","100+","-","-","-"]
["pump_motor_nc",null,"100-150","0-50","-","-","-"]
["pump_motor_nc",null,"100-150","50-100","-","-","-"]
["pump_motor_nc",null,"100-150","100+","-","-","-"]
["pump_motor_nc",null,"150-200","0-50","-","-","-"]
["pump_motor_nc",null,"150-200","50-100","-","-","-"]
["pump_motor_nc",null,"150-200","100+","-","-","-"]
["pump_motor_nc",null,"200-300","0-50","-","-","-"]
["pump_motor_nc",null,"200-300","50-100","-","-","-"]
["pump_motor_nc",null,"200-300","100+","-","-","-"]
["pump_motor_nc",null,"300-800","0-50","-","-","-"]
["pump_motor_nc",null,"300-800","50-100","-","-","-"]
["pump_motor_nc",null,"300-800","100+","-","-","-"]
["pump_motor_nc",null,"800+","0-50","-","-","-"]
["pump_motor_nc",null,"800+","50-100","-","-","-"]
["pump_motor_nc",null,"800+","100+","-","-","-"]

{"sheet":"Site Specific Savings","index":2,"n_rows":33,"n_cols":16,"rows_kept":33,"cut":false,"hidden":false,"merged":[[7,15,8,17],[9,15,9,17],[7,11,8,13],[9,11,9,13],[20,11,20,13],[18,11,19,13],[16,11,16,13],[15,11,15,13],[11,11,12,13],[11,15,12,17],[32,13,32,15],[30,13,31,15],[28,13,28,15],[26,13,27,15],[24,11,24,13],[22,11,23,13],[3,11,3,17],[12,6,12,8],[24,15,24,17],[22,15,23,17],[13,1,13,8],[15,2,15,6],[20,2,20,6],[21,2,21,6],[22,2,22,6],[13,15,13,17],[13,11,13,13],[20,15,20,17],[18,15,19,17],[16,15,16,17],[15,15,15,17],[3,6,3,9],[25,2,25,6],[30,2,30,6],[19,2,19,6],[18,2,18,6],[17,2,17,6],[29,2,29,6],[26,2,26,6],[27,2,27,6],[28,2,28,6],[16,2,16,8],[23,2,23,8],[24,2,24,6]]}
[null,"Site-Based Energy Savings Calculations"]
[]
[]
[null,null,null,null,null,null,"System Information",null,null,null,null,"Total Change in Life Cycle Costs ($)"]
[]
[null,null,null,null,null,null,null,"State"]
[null,null,null,null,null,null,null,"Pumping Application"]
[null,null,null,null,null,null,null,"Cost of Electricity, $/kWh (if Unknown, Leave Blank)",null,null,null,"Lifetime Energy \nSavings (kWh)",null,null,null,"Lifetime Energy \nSavings ($)"]
[null,null,null,null,null,null,null,"Pump Lifetime used in calculation",{"$f":"ROUND('Site_based calculation'!B5,0)&\" years\"","v":"14 years"}]
[null,null,null,null,null,null,null,"Cost of electricity used in calculation, $/kWh",{"$f":"'Site_based calculation'!B3","v":0.10529999999999999},null,null,{"$f":"IF('Site_based calculation'!B4=\"No\",\"\",'Site_based calculation'!B23)","v":""},null,null,null,{"$f":"IF('Site_based calculation'!B4=\"No\",\"\",'Site_based calculation'!B25)","v":""}]
[null,null,null,null,null,null,"INSTRUCTIONS: "]
[null,null,null,null,null,null,"Enter required information in the Yellow cells.  Enter Baseline Information first.",null,null,null,null,"Incremental Increase in Equipment Cost ($)",null,null,null,"Change in Installation/ Commissioning Cost ($)"]
[null,null,null,null,null,null,"Enter any additional OPTIONAL information you want to include in the calculation in the blue cells. "]
[null,null,null,null,null,null,null,null,null,null,null,{"$f":"IF(OR(I25=\"\",H25=\"\"),\"Not currently calculated\",'Site_based calculation'!B30*-1)","v":"Not currently calculated"},null,null,null,{"$f":"IF(OR(I26=\"\",H26=\"\"),\"Not currently calculated\",'Site_based calculation'!B33*-1)","v":"Not currently calculated"}]
[]
[null,null,"Pump Information",null,null,null,null,"Baseline Pumping \nSystem","Efficient Pumping System",null,null,"Change in Annual\nOperating Costs ($/year)",null,null,null,"Change in Lifetime\nOperating Costs ($)"]
[null,null,"Energy Savings",null,null,null,null,null,null,null,null,{"$f":"IF(OR(I27=\"\",H27=\"\"),\"Not currently calculated\",'Site_based calculation'!B36*-1)","v":"Not currently calculated"},null,null,null,{"$f":"IF(OR(I27=\"\",H27=\"\"),\"Not currently calculated\",'Site_based calculation'!B37*-1)","v":"Not currently calculated"}]
[null,null,"Pump Type (if Unknown, Leave Blank)",null,null,null,null,null,{"$f":"IF(H18=\"\",\"\",H18)","v":""}]
[null,null,"Motor Horsepower",null,null,null,null,null,null,null,null,"Change in Annual Maintenance and Repair Costs ($/year)",null,null,null,"Change in Maintenance and Repair Costs ($)"]
[null,null,"Operating Hours (if Unknown, Leave Blank)"]
[null,null,"Pump Lifetime (if Unknown, Leave Blank)",null,null,null,null,null,{"$f":"IF(H21=\"\",\"\",H21)","v":""},null,null,{"$f":"IF(OR(I28=\"\",H28=\"\"),\"Not currently calculated\",'Site_based calculation'!B40*-1)","v":"Not currently calculated"},null,null,null,{"$f":"IF(OR(I28=\"\",H28=\"\"),\"Not currently calculated\",'Site_based calculation'!B41*-1)","v":"Not currently calculated"}]
[null,null,"Pump Speed Control"]
[null,null,"Energy Rating",null,null,null,null,null,null,null,null,"Change in Annual Downtime and Production Loss Costs ($/year)",null,null,null,"Change in Lifetime Downtime and Production Loss Costs ($)"]
[]
[null,null,"Initial Pump Cost ($)",null,null,null,null,null,null,null,null,{"$f":"IF(OR(I29=\"\",H29=\"\"),\"Not currently calculated\",'Site_based calculation'!B44*-1)","v":"Not currently calculated"},null,null,null,{"$f":"IF(OR(I29=\"\",H29=\"\"),\"Not currently calculated\",'Site_based calculation'!B45*-1)","v":"Not currently calculated"}]
[null,null,"Installation and Commissioning Cost ($)"]
[null,null,"Annual Operating Cost ($/year)",null,null,null,null,null,null,null,null,null,null,"Change in Disposal and Decommissioning Costs ($)"]
[null,null,"Annual Maintenance and Repair costs ($/year)"]
[null,null,"Annual Downtime and loss of production ($)",null,null,null,null,null,null,null,null,null,null,{"$f":"IF(OR(I30=\"\",H30=\"\"),\"Not currently calculated\",'Site_based calculation'!B48*-1)","v":"Not currently calculated"}]
[null,null,"Disposal and Decommissioning Costs ($)"]
[null,null," Lifetime Environmental costs ($)",null,null,null,null,null,null,null,null,null,null,"Change in Lifetime Environmental Costs ($)"]
[]
[null,null,null,null,null,null,null,null,null,null,null,null,null,{"$f":"IF(OR(I31=\"\",H31=\"\"),\"Not currently calculated\",'Site_based calculation'!B51*-1)","v":"Not currently calculated"}]

{"sheet":"General Savings","index":3,"n_rows":51,"n_cols":16,"rows_kept":51,"cut":false,"hidden":false,"merged":[[4,13,6,13],[20,2,20,5],[26,2,27,5],[24,4,24,5],[23,4,23,5],[22,4,22,5],[21,4,21,5],[20,13,20,15],[26,13,27,15],[20,8,20,10],[21,8,21,9],[26,8,27,10],[31,4,31,5],[30,4,30,5],[29,4,29,5],[28,4,28,5],[25,4,25,5],[40,8,40,9],[39,8,39,10],[45,8,46,10],[39,13,39,15],[45,13,46,15]]}
["General Energy Savings Calculations"]
[]
[]
[]
[null,null,"General System information","Enter Information Here",null,null,null,null,null,null,null,null,null,"Number of Pumps in the ER \ndatabase that meet your \nspecified design point: "]
[null,null,"State"]
[null,null,"Application"]
[null,null,"Price of Electricity ($/kW)",{"$f":"IF(D6=\"\",'Cost of Electricity'!B8,VLOOKUP(D6,'Cost of Electricity'!$A$9:$B$60,2,FALSE))","v":0.10529999999999999}]
[null,null,"Pump Type"]
[null,null,"Does Existing Pump Have a Variable Speed Drive?"]
[null,null,"Motor HP"]
[]
[null,null,"Do you know the design requirements?"]
[null,null,{"$f":"IF(D13=\"Yes\",\"Design Head, ft\",IF(D13=\"No\",\"\",\"Design Head, ft\"))","v":"Design Head, ft"}]
[null,null,{"$f":"IF(D13=\"Yes\",\"Design Flow, gpm\",IF(D13=\"No\",\"\",\"Design Flow, gpm\"))","v":"Design Flow, gpm"}]
[null,null,null,null,null,null,"INSTRUCTIONS:"]
[]
[null,null,null,null,null,null,"Enter REQUIRED information in the Yellow cells.  "]
[null,null,null,null,null,null,"If you know the design point information, enter that into the BLUE cells (this is optional). "]
[]
[null,null,"Minimum Energy Savings",null,null,null,null,null,"Choose your own Energy Rating",null,null,null,null,"Most Efficient Pump"]
[null,null,"Minimum ER for Energy Savings",{"$f":"IF('General_savings Calculations'!B10=\"No\",\"\",'General_savings Calculations'!B16)","v":""},null,null,null,null,{"$f":"\"Please Choose an ER between \"&'General_savings Calculations'!B16&\" and \"&'General_savings Calculations'!B18&\":\"","v":"Please Choose an ER between 0 and 0:"},null,null,null,null,"Maximum Energy Rating",{"$f":"IF('General_savings Calculations'!B10=\"No\",\"\",'General_savings Calculations'!B18)","v":""}]
[]
[null,null,"Average Pump Lifetime",{"$f":"IF('General_savings Calculations'!B10=\"No\",\"\",VLOOKUP('General_savings Calculations'!B6,Lifetime!B3:C7,2,FALSE))","v":""},null,null,null,null,"Average Pump Lifetime",{"$f":"IF(OR(K22<Minimum,K22>Maximum),\"\",IF(K22=\"\",\"\",IF('General_savings Calculations'!B10=\"No\",\"\",VLOOKUP('General_savings Calculations'!B6,Lifetime!B3:C7,2,FALSE))))","v":""},null,null,null,"Average Pump Lifetime",{"$f":"IF('General_savings Calculations'!B10=\"No\",\"\",VLOOKUP('General_savings Calculations'!B6,Lifetime!B3:C7,2,FALSE))","v":""}]
[null,null,"Annual Energy Savings",{"$f":"IF('General_savings Calculations'!B10=\"No\",\"\",'General_savings Calculations'!B19*'General_savings Calculations'!B13)","v":""},{"$f":"IF('General_savings Calculations'!B10=\"no\",\"\",\"kWh/year\")","v":""},null,null,null,"Annual Energy Savings",{"$f":"IF(OR(K22<Minimum,K22>Maximum),\"\",IF(K22=\"\",\"\",IF('General_savings Calculations'!B10=\"no\",\"\",'General_savings Calculations'!B21*'General_savings Calculations'!B13)))","v":""},{"$f":"IF(K22=\"\",\"\",IF('General_savings Calculations'!B10=\"no\",\"\",\"kWh/year\"))","v":""},null,null,"Annual Energy Savings",{"$f":"IF('General_savings Calculations'!B10=\"No\",\"\",'General_savings Calculations'!B23*'General_savings Calculations'!B13)","v":""},{"$f":"IF('General_savings Calculations'!B10=\"no\",\"\",\"kWh/year\")","v":""}]
[null,null,"Lifetime Energy Savings",{"$f":"IF('General_savings Calculations'!B10=\"no\",\"\",D25*'General_savings Calculations'!B25)","v":""},{"$f":"IF('General_savings Calculations'!B10=\"no\",\"\",\"kWh\")","v":""},null,null,null,"Lifetime Energy Savings",{"$f":"IF(OR(K22<Minimum,K22>Maximum),\"\",IF(K22=\"\",\"\",IF('General_savings Calculations'!B10=\"no\",\"\",J25*'General_savings Calculations'!B25)))","v":""},{"$f":"IF(K22=\"\",\"\",IF('General_savings Calculations'!B10=\"no\",\"\",\"kWh\"))","v":""},null,null,"Lifetime Energy Savings",{"$f":"IF('General_savings Calculations'!B10=\"No\",\"\",O25*'General_savings Calculations'!B25)","v":""},{"$f":"IF('General_savings Calculations'!B10=\"no\",\"\",\"kWh\")","v":""}]
[null,null,"Life Cycle Cost Assessment",null,null,null,null,null,"Life Cycle Cost Assessment",null,null,null,null,"Life Cycle Cost Assessment"]
[]
[null,null,"Incremental Increase in Initial Cost",{"$f":"IF('General_savings Calculations'!B10=\"no\",\"\",'General_savings Calculations'!B20*'General_savings Calculations'!B13)","v":""},null,null,null,null,"Incremental Increase in initial Cost",{"$f":"IF(OR(K22<Minimum,K22>Maximum),\"\",IF(K22=\"\",\"\",IF('General_savings Calculations'!B10=\"no\",\"\",'General_savings Calculations'!B22*'General_savings Calculations'!B13)))","v":""},null,null,null,"Incremental Increase in initial Cost",{"$f":"IF('General_savings Calculations'!B10=\"No\",\"\",'General_savings Calculations'!B24*'General_savings Calculations'!B13)","v":""}]
[null,null,"Energy Savings",{"$f":"IF('General_savings Calculations'!B10=\"no\",\"\",D25*D8)","v":""},{"$f":"IF('General_savings Calculations'!B10=\"no\",\"\",\"per year\")","v":""},null,null,null,"Energy Savings",{"$f":"IF(OR(K22<Minimum,K22>Maximum),\"\",IF(K22=\"\",\"\",IF('General_savings Calculations'!B10=\"no\",\"\",J25*D8)))","v":""},{"$f":"IF(K22=\"\",\"\",IF('General_savings Calculations'!B10=\"no\",\"\",\"per year\"))","v":""},null,null,"Energy Savings",{"$f":"IF('General_savings Calculations'!B10=\"No\",\"\",O25*D8)","v":""},{"$f":"IF('General_savings Calculations'!B10=\"no\",\"\",\"per year\")","v":""}]
[null,null,"Payback Period",{"$f":"IF('General_savings Calculations'!B10=\"no\",\"\",D29/D30)","v":""},{"$f":"IF('General_savings Calculations'!B10=\"no\",\"\",\"years\")","v":""},null,null,null,"Payback Period",{"$f":"IF(OR(K22<Minimum,K22>Maximum),\"\",IF(K22=\"\",\"\",IF('General_savings Calculations'!B10=\"no\",\"\",J29/J30)))","v":""},{"$f":"IF(K22=\"\",\"\",IF('General_savings Calculations'!B10=\"no\",\"\",\"years\"))","v":""},null,null,"Payback Period",{"$f":"IF('General_savings Calculations'!B10=\"No\",\"\",O29/O30)","v":""},{"$f":"IF('General_savings Calculations'!B10=\"no\",\"\",\"years\")","v":""}]
[null,null,"Lifetime Savings",{"$f":"IF('General_savings Calculations'!B10=\"no\",\"\",(D26*D8)-D29)","v":""},null,null,null,null,"Lifetime Savings",{"$f":"IF(OR(K22<Minimum,K22>Maximum),\"\",IF(K22=\"\",\"\",IF('General_savings Calculations'!B10=\"no\",\"\",J26*D8-J29)))","v":""},null,null,null,"Lifetime Savings",{"$f":"IF('General_savings Calculations'!B10=\"No\",\"\",O26*D8-O29)","v":""}]
[]
[]
[]
[]
[]
[]
[]
[null,null,null,null,null,null,null,null,"Choose your own Energy Rating",null,null,null,null,"Most Efficient, with VSD"]
[null,null,null,{"$f":"IF(D10=\"Yes\",\"\",\"Addition of Variable Speed Control\")","v":"Addition of Variable Speed Control"},null,null,null,null,{"$f":"\"Please Choose an ER between \"&'General_savings Calculations'!B31&\" and \"&'General_savings Calculations'!B33&\":\"","v":"Please Choose an ER between 0 and 0:"},null,null,null,null,"Maximum Energy Rating",{"$f":"IF('General_savings Calculations'!B10=\"No\",\"\",'General_savings Calculations'!B33)","v":""}]
[]
[null,null,null,null,null,null,null,null,"Average Pump Lifetime",{"$f":"IF(OR(K41<VSDMin,K41>VSDMax),\"\",IF(K41=\"\",\"\",IF('General_savings Calculations'!B10=\"No\",\"\",VLOOKUP('General_savings Calculations'!B6,Lifetime!B3:C7,2,FALSE))))","v":""},null,null,null,"Average Pump Lifetime",{"$f":"IF('General_savings Calculations'!B10=\"No\",\"\",VLOOKUP('General_savings Calculations'!B6,Lifetime!B3:C7,2,FALSE))","v":""}]
[null,null,null,null,null,null,null,null,"Annual Energy Savings",{"$f":"IF(OR(K41<VSDMin,K41>VSDMax),\"\",IF(K41=\"\",\"\",IF('General_savings Calculations'!B10=\"No\",\"\",'General_savings Calculations'!B36*'General_savings Calculations'!B13)))","v":""},{"$f":"IF('General_savings Calculations'!B10=\"No\",\"\",\"kWh/year\")","v":""},null,null,"Annual Energy Savings",{"$f":"IF('General_savings Calculations'!B10=\"No\",\"\",'General_savings Calculations'!B38*'General_savings Calculations'!B13)","v":""},{"$f":"IF('General_savings Calculations'!B10=\"No\",\"\",\"kWh/year\")","v":""}]
[null,null,null,null,null,null,null,null,"Lifetime Energy Savings",{"$f":"IF(OR(K41<VSDMin,K41>VSDMax),\"\",IF(K41=\"\",\"\",IF('General_savings Calculations'!B10=\"No\",\"\",J44*'General_savings Calculations'!B25)))","v":""},{"$f":"IF('General_savings Calculations'!B10=\"No\",\"\",\"kWh\")","v":""},null,null,"Lifetime Energy Savings",{"$f":"IF('General_savings Calculations'!B10=\"No\",\"\",O44*'General_savings Calculations'!B25)","v":""},{"$f":"IF('General_savings Calculations'!B10=\"No\",\"\",\"kWh\")","v":""}]
[null,null,null,null,null,null,null,null,"Life Cycle Cost Assessment",null,null,null,null,"Life Cycle Cost Assessment"]
[]
[null,null,null,null,null,null,null,null,"Incremental Increase in initial Cost",{"$f":"IF(OR(K41<VSDMin,K41>VSDMax),\"\",IF(K41=\"\",\"\",IF('General_savings Calculations'!B10=\"No\",\"\",'General_savings Calculations'!B37*'General_savings Calculations'!B13)))","v":""},null,null,null,"Incremental Increase in initial Cost",{"$f":"IF('General_savings Calculations'!B10=\"No\",\"\",'General_savings Calculations'!B39*'General_savings Calculations'!B13)","v":""}]
[null,null,null,null,null,null,null,null,"Energy Savings",{"$f":"IF(OR(K41<VSDMin,K41>VSDMax),\"\",IF(K41=\"\",\"\",IF('General_savings Calculations'!B10=\"No\",\"\",J44*D8)))","v":""},{"$f":"IF('General_savings Calculations'!B10=\"No\",\"\",\"per year\")","v":""},null,null,"Energy Savings",{"$f":"IF('General_savings Calculations'!B10=\"No\",\"\",O44*D8)","v":""},{"$f":"IF('General_savings Calculations'!B10=\"No\",\"\",\"per year\")","v":""}]
[null,null,null,null,null,null,null,null,"Payback Period",{"$f":"IF(OR(K41<VSDMin,K41>VSDMax),\"\",IF(K41=\"\",\"\",IF('General_savings Calculations'!B10=\"No\",\"\",J48/J49)))","v":""},{"$f":"IF('General_savings Calculations'!B10=\"No\",\"\",\"years\")","v":""},null,null,"Payback Period",{"$f":"IF('General_savings Calculations'!B10=\"No\",\"\",O48/O49)","v":""},{"$f":"IF('General_savings Calculations'!B10=\"No\",\"\",\"years\")","v":""}]
[null,null,null,null,null,null,null,null,"Lifetime Savings",{"$f":"IF(OR(K41<VSDMin,K41>VSDMax),\"\",IF(K41=\"\",\"\",IF('General_savings Calculations'!B10=\"No\",\"\",J45*D8-J48)))","v":""},null,null,null,"Lifetime Savings",{"$f":"IF('General_savings Calculations'!B10=\"No\",\"\",O45*D8-O48)","v":""}]

{"sheet":"AdditionalInformation","index":4,"n_rows":7,"n_cols":6,"rows_kept":7,"cut":false,"hidden":false,"merged":[[3,1,4,16],[6,1,8,16]]}
[null,null,null,null,null,"Energy Savings Calculations, Additional Information"]
[]
[]
[null,"To calculate energy savings this workbook makes certain assumptions. These assumptions are based on operational information collected on commercial and industrial clean water pumps. This tab discusses three aspects of the energy analysis: \nVariable Speed Pump Operation\nOperating Hours\nLoad Profile\n"]
[]
[]
[null,"For more detailed information on the energy savings equation and the information used in for this calculator, see the Deemed Measure List and Technical Resources Manual (TRM)\nat http://www.pumps.org/Utility_Resources.aspx "]

{"sheet":"Site_based calculation","index":5,"n_rows":57,"n_cols":3,"rows_kept":57,"cut":false,"hidden":true,"merged":[]}
["Energy"]
["Application",{"$f":"'Site Specific Savings'!I7","v":0}]
["Cost of Electricity",{"$f":"IF('Site Specific Savings'!I8=\"\",IF('Site Specific Savings'!I6=\"\",'Cost of Electricity'!B8,VLOOKUP('Site Specific Savings'!I6,'Cost of Electricity'!A8:B60,2,FALSE)),'Site Specific Savings'!I8)","v":0.10529999999999999}]
["Enough information for calculation",{"$f":"IF(OR('Site Specific Savings'!I6=\"\",'Site Specific Savings'!I7=\"\",'Site Specific Savings'!H19=\"\",'Site Specific Savings'!H23=\"\",'Site Specific Savings'!H22=\"\",'Site Specific Savings'!I23=\"\",'Site Specific Savings'!I22=\"\",'Site Specific Savings'!I19=\"\",'Site Specific Savings'!I23=\"\",'Site Specific Savings'!I22=\"\"),\"No\",\"Yes\")","v":"No"}]
["Base Case Lifetime",{"$f":"IF(AND('Site Specific Savings'!H18=\"\",'Site Specific Savings'!H21=\"\"),AVERAGE('Site-specific Lists'!$AO$3:$AO$7),\nIF('Site Specific Savings'!H21=\"\",VLOOKUP('Site Specific Savings'!H18,'Site-specific Lists'!$AN$3:$AO$7,2,FALSE),'Site Specific Savings'!H21))","v":14.100800000000001}]
["Base Case Operating Hours",{"$f":"IF('Site Specific Savings'!H20=\"\",VLOOKUP('Site Specific Savings'!I7,'Site-specific Lists'!$A$3:$B$9,2,FALSE),'Site Specific Savings'!H20)","v":{"$error":"#N/A"}}]
["Base Case Motor Horsepower",{"$f":"'Site Specific Savings'!H19","v":0}]
["Base Case Motor Horsepower Bin",{"$f":"IF(B13=\"VS->VS\",INDEX('Site-specific Lists'!AA3:AA7,MATCH('Site_based calculation'!B7,'Site-specific Lists'!Z3:Z7,-1)),\nIF(B13=\"CS->CS\",INDEX('Site-specific Lists'!$AD$3:$AD$6,MATCH('Site_based calculation'!B7,'Site-specific Lists'!AC3:AC6,-1)),\nIF(B13=\"CS->VS\",INDEX('Site-specific Lists'!$AG$3:$AG$7,MATCH('Site_based calculation'!B7,'Site-specific Lists'!AF3:AF7,-1)),FALSE())))","v":false}]
["Base Case Energy Rating",{"$f":"'Site Specific Savings'!H23","v":0}]
["Base Case Motor Oversizing",{"$f":"INDEX('Site-specific Lists'!O4:O13,MATCH('Site_based calculation'!B8,'Site-specific Lists'!$N$4:$N$13,0))","v":{"$error":"#N/A"}}]
["Base Case Load Factor",{"$f":"VLOOKUP(B2,'Site-specific Lists'!$AJ$3:$AL$9,IF(B13=\"CS->CS\",2,IF(B13=\"VS->VS\",3,IF(B13=\"CS->VS\",2,FALSE()))),FALSE)","v":{"$error":"#N/A"}}]
["Base Case Energy Consumption (kWh/year)",{"$f":"IF(B13=\"CS->CS\",B6*(1-B10)*B7*(0.746)*((100-B9)/100)*B11,\nIF(B13=\"VS->VS\",B6*(1-B10)*B7*(0.746)*((100-B9)/100)*B11,\nIF(B13=\"CS->VS\",(B6*(1-B10)*B7*(0.746)*((100-B9)/100)*((B11*0.9175)+(B20*0.0825))),FALSE())))","v":false}]
["Speed Control",{"$f":"IF(AND('Site Specific Savings'!H22=\"Constant Speed Control\",'Site Specific Savings'!I22=\"Constant Speed Control\"),\"CS->CS\",IF(AND('Site Specific Savings'!H22=\"Constant Speed Control\",'Site Specific Savings'!I22=\"Variable Speed Control\"),\"CS->VS\",IF(AND('Site Specific Savings'!H22=\"Variable Speed Control\",'Site Specific Savings'!I22=\"Variable Speed Control\"),\"VS->VS\")))","v":false}]
["Efficient Case Lifetime",{"$f":"IF('Site Specific Savings'!I21<>\"\",'Site Specific Savings'!I21,\nIF('Site Specific Savings'!I18=\"\",B5,\nIF(('Site Specific Savings'!H18='Site Specific Savings'!I18)=TRUE,B5,(IF('Site Specific Savings'!I18<>\"\",VLOOKUP('Site Specific Savings'!I18,'Site-specific Lists'!$AN$3:$AO$7,2,FALSE),AVERAGE('Site-specific Lists'!AO3:AO7))))))","v":14.100800000000001}]
["Efficient Case Operating Hours",{"$f":"IF('Site Specific Savings'!I20<>\"\",'Site Specific Savings'!I20,IF('Site Specific Savings'!H20<>\"\",B6,VLOOKUP('Site Specific Savings'!I7,'Site-specific Lists'!$A$3:$B$9,2,FALSE)))","v":{"$error":"#N/A"}}]
["Efficient Case Motor Horsepower",{"$f":"'Site Specific Savings'!I19","v":0}]
["Efficient Case Motor Horsepower Bin",{"$f":"IF(B13=\"VS->VS\",INDEX('Site-specific Lists'!AA3:AA7,MATCH('Site_based calculation'!B16,'Site-specific Lists'!Z3:Z7,-1)),\nIF(B13=\"CS->CS\",INDEX('Site-specific Lists'!$AD$3:$AD$6,MATCH('Site_based calculation'!B16,'Site-specific Lists'!AC3:AC6,-1)),\nIF(B13=\"CS->VS\",INDEX('Site-specific Lists'!$AG$3:$AG$7,MATCH('Site_based calculation'!B16,'Site-specific Lists'!AF3:AF7,-1)),FALSE())))","v":false}]
["Efficient Case Energy Rating",{"$f":"'Site Specific Savings'!I23","v":0}]
["Base Case Motor Oversizing",{"$f":"INDEX('Site-specific Lists'!O4:O13,MATCH('Site_based calculation'!B17,'Site-specific Lists'!$N$4:$N$13,0))","v":{"$error":"#N/A"}}]
["Efficient Case Load Factor",{"$f":"VLOOKUP(B2,'Site-specific Lists'!$AJ$3:$AL$9,IF(B13=\"CS->CS\",2,IF(B13=\"VS->VS\",3,IF(B13=\"CS->VS\",3,FALSE()))),FALSE)","v":{"$error":"#N/A"}}]
["Efficient Case Energy Consumption (kWh/year)",{"$f":"B15*(1-B19)*B16*(0.746)*((100-B18)/100)*B20","v":{"$error":"#N/A"}}]
["Energy Savings (kWh/year)",{"$f":"B12-B21","v":{"$error":"#N/A"}}]
["Lifetime Energy Savings (kWh)",{"$f":"B22*B5","v":{"$error":"#N/A"}}]
["Cost Savings ($/year)",{"$f":"B22*B3","v":{"$error":"#N/A"}}]
["Lifetime Cost Savings ($)",{"$f":"B23*B3","v":{"$error":"#N/A"}}]
[]
["LCC Terms"]
["User Entered Cost of Base Case Pump",{"$f":"'Site Specific Savings'!H25","v":0}]
["User Entered Cost of Efficient Pump",{"$f":"'Site Specific Savings'!I25","v":0}]
["Savings from Pump increase in cost",{"$f":"B28-B29","v":0},{"$f":"IF('Site Specific Savings'!$L$14=\"Not currently calculated\",0,1)","v":0}]
["User Entered Cost of Installation and Commissioning, Base Case",{"$f":"'Site Specific Savings'!H26","v":0}]
["User Entered Cost of Installation and Commissioning, Efficient Case",{"$f":"'Site Specific Savings'!I26","v":0}]
["Savings from Installation and Commissioning",{"$f":"B31-B32","v":0},{"$f":"IF('Site Specific Savings'!$P$14=\"Not currently calculated\",0,1)","v":0}]
["User Entered annual operating cost, Base Case",{"$f":"'Site Specific Savings'!H27","v":0}]
["User Entered annual operating cost, Efficient Case",{"$f":"'Site Specific Savings'!I27","v":0}]
["Savings from annual operating cost",{"$f":"B34-B35","v":0}]
["Savings from lifetime operating cost",{"$f":"B36*$B$5","v":0},{"$f":"IF('Site Specific Savings'!$P$17=\"Not currently calculated\",0,1)","v":0}]
["User Entered annual maintenance and repair cost, Base Case",{"$f":"'Site Specific Savings'!H28","v":0}]
["User Entered annual maintenance and repair cost, Efficient Case",{"$f":"'Site Specific Savings'!I28","v":0}]
["Savings from annual maintenance and repair cost",{"$f":"B38-B39","v":0}]
["Savings from lifetime maintenance and repair cost",{"$f":"B40*$B$5","v":0},{"$f":"IF('Site Specific Savings'!$P$21=\"Not currently calculated\",0,1)","v":0}]
["User Entered annual downtime and loss of production, Base Case",{"$f":"'Site Specific Savings'!H29","v":0}]
["User Entered annual downtime and loss of production,Efficient Case",{"$f":"'Site Specific Savings'!I29","v":0}]
["Savings from annual downtime and loss of production",{"$f":"B42-B43","v":0}]
["Savings from lifetime downtime and loss of production",{"$f":"B44*$B$5","v":0},{"$f":"IF('Site Specific Savings'!$P$25=\"Not currently calculated\",0,1)","v":0}]
["User Entered Disposal and Decommissioning Costs, Base Case",{"$f":"'Site Specific Savings'!H30","v":0}]
["User Entered Disposal and Decommissioning Costs, Efficient Case",{"$f":"'Site Specific Savings'!I30","v":0}]
["Savings from Disposal and Decommissioning Costs",{"$f":"B46-B47","v":0},{"$f":"IF('Site Specific Savings'!$N$29=\"Not currently calculated\",0,1)","v":0}]
["User Entered Environmental Costs, Base Case",{"$f":"'Site Specific Savings'!H31","v":0}]
["User Entered Environmental Costs, Efficient Case",{"$f":"'Site Specific Savings'!I31","v":0}]
["Savings from Environmental Costs",{"$f":"B49-B50","v":0},{"$f":"IF('Site Specific Savings'!$N$33=\"Not currently calculated\",0,1)","v":0}]
[]
["Total Savings",{"$f":"SUMIF(C28:C51,1,B28:B51)+B25","v":{"$error":"#N/A"}}]
[null,"The modeled pump replacement results in a savings of "]
[null,"The modeled pump replacement results in an increase in cost of "]
[null," over the lifetime of the pump"]
[null,{"$f":"IF(B4=\"No\",\"Please enter pump-specific information in the yellow cells below\",IF(B53>0,B54&\"$\"&ROUND(B53,2)&B56,B55&\"$ \"&ROUND(B53,2)*-1&B56))","v":"Please enter pump-specific information in the yellow cells below"}]

{"sheet":"General_savings Calculations","index":6,"n_rows":40,"n_cols":9,"rows_kept":40,"cut":false,"hidden":true,"merged":[[1,0,1,1],[25,7,25,8],[11,0,11,1],[3,4,3,5],[25,0,25,1]]}
[]
["Pump information"]
["Speed Control",{"$f":"VLOOKUP('General Savings'!D10,Lists!K3:N4,3,FALSE)","v":{"$error":"#N/A"}}]
["ER_Database Speed Control Code",{"$f":"IF(B3=\"Variable Speed\",\"variable\",\"constant\")","v":{"$error":"#N/A"}},null,null,"If design point is provided",null,"BEP Bins",{"$f":"AVERAGE(IF(((MeasureTable!B9:B536=B5)*(MeasureTable!C9:C536=B9)*(MeasureTable!D9:D536=F14)*(MeasureTable!E9:E536='General Savings'!K22))>0,MeasureTable!R9:R536))","v":{"$error":"#N/A"}}]
["Measure Speed Control Code",{"$f":"VLOOKUP('General Savings'!D10,Lists!K3:N4,4,FALSE)","v":{"$error":"#N/A"}},null,null,"Design Flow",{"$f":"'General Savings'!D15","v":0},{"$f":"INDEX(Lists!$AE$2:$AE$8,MATCH(F5,Lists!$AF$2:$AF$8,1))","v":{"$error":"#N/A"}}]
["Pump Type",{"$f":"VLOOKUP('General Savings'!D9,Lists!$E$3:$F$7,2,FALSE)","v":{"$error":"#N/A"}},null,null,"Design Head",{"$f":"'General Savings'!D14","v":0},{"$f":"INDEX(Lists!$AI$2:$AI$4,MATCH(F6,Lists!$AJ$2:$AJ$4,1))","v":{"$error":"#N/A"}}]
["Motor HP",{"$f":"'General Savings'!D11","v":0}]
["Nominal Speed",null,null,null,"Number of pumps that meet the design requirements",{"$f":"_xlfn.IFNA(SUMPRODUCT(('sample-llc'!$B$203:$B$622=B6)*('sample-llc'!$A$203:$A$622=B4)*('sample-llc'!$C$203:$C$622=$G$5)*('sample-llc'!$D$203:$D$622=G6)*('sample-llc'!$F$203:$F$622<>\"-\")),0)","v":0}]
["Application",{"$f":"'General Savings'!D7","v":0},null,null,"Does ER Database list a pump with the specific head and flow requirements provided?",{"$f":"IF(F8=0,\"No\",\"Yes\")","v":"No"}]
["Is there enough info provided",{"$f":"IF(OR('General Savings'!D7=\"\",'General Savings'!D9=\"\",'General Savings'!D10=\"\",'General Savings'!D13=\"\",B7=0),\"No\",\"Yes\")","v":"No"}]
[]
["Used in Calculations",null,null,null,null,null,null,"If Design Point is not provided"]
["ER Database Motor HP",{"$f":"IF('General Savings'!D13=\"Yes\",F13,I13)","v":1},null,null,"ER Database Motor HP if design point not in database",{"$f":"'General Savings'!D11","v":0},null,"ER Database Motor HP",{"$f":"INDEX(Lists!Y2:Y21,MATCH('General Savings'!D11,Lists!Y2:Y21,-1))","v":1}]
[null,null,null,null,"Measure Motor HP bin",{"$f":"IF(B3=\"Constant Speed\",INDEX(ConstantSpeed,MATCH(F13,Lists!T3:T8,-1)),INDEX(VariableSpeed,MATCH(F13,Lists!Q3:Q10,-1)))","v":{"$error":"#N/A"}},null,"Measure Motor HP bin",{"$f":"_xlfn.IFNA(IF(B3=\"Constant Speed\",INDEX(ConstantSpeed,MATCH('General Savings'!D11,Lists!T3:T8,-1)),INDEX(VariableSpeed,MATCH('General Savings'!D11,Lists!Q3:Q10,-1))),0)","v":0}]
[null,null,null,null,"Max Energy Rating from ER DB",{"$f":"_xlfn.IFNA(IF(F9=\"Yes\",MAX(IF((('sample-llc'!$A$203:$A$622=B4)*('sample-llc'!$B$203:$B$622=B6)*('sample-llc'!$C$203:$C$622=$G$5)*('sample-llc'!$D$203:$D$622=G6))>0,'sample-llc'!$G$203:$G$622)),F17),0)","v":0},null,"Max Energy Rating from ER DB",{"$f":"_xlfn.IFNA(MAX(IF((('sample-llc'!$B$2:$B$201=I13)*('sample-llc'!$C$2:$C$201=B6)*('sample-llc'!$A$2:$A$201=B4))>0,'sample-llc'!$D$2:$D$201)),0)","v":0}]
["Min_ER from measures for this combination",{"$f":"IF('General Savings'!D13=\"Yes\",F16,I16)","v":0},null,null,"Min_ER from measures for this combination",{"$f":"_xlfn.IFNA(MIN(IF(((MeasureTable!B9:B536=B5)*(MeasureTable!C9:C536=B9)*(MeasureTable!D9:D536=F14))>0,MeasureTable!E9:E536)),0)","v":0},null,"Min_ER from measures for this combination",{"$f":"_xlfn.IFNA(MIN(IF(((MeasureTable!$B$9:$B$536=B5)*(MeasureTable!$C$9:$C$536=B9)*(MeasureTable!$D$9:$D$536=I14))>0,MeasureTable!E9:E536)),0)","v":0}]
[null,null,null,null,"Max_ER from measures for this combination",{"$f":"_xlfn.IFNA(MAX(IF(((MeasureTable!B9:B536=B5)*(MeasureTable!C9:C536=B9)*(MeasureTable!D9:D536=F14))>0,MeasureTable!E9:E536)),0)","v":0},null,"Max_ER from measures for this combination",{"$f":"_xlfn.IFNA(MAX(IF(((MeasureTable!$B$9:$B$536=B5)*(MeasureTable!$C$9:$C$536=B9)*(MeasureTable!$D$9:$D$536=I14))>0,MeasureTable!$E$9:$E$536)),0)","v":0}]
["Max ER_for calculation",{"$f":"IF('General Savings'!D13=\"Yes\",F18,I18)","v":0},null,null,"Max ER_for calculation",{"$f":"IF(F15<F16,F17,IF(F15=0,F17,MAX(F15,F17)))","v":0},null,"Max ER_for calculation",{"$f":"IF(I15<I16,I17,IF(I15=0,I17,MAX(I15,I17)))","v":0}]
["Min Energy Savings (kWh/HP/year)",{"$f":"IF('General Savings'!D13=\"Yes\",F19,I19)","v":0},null,null,"Min Energy Savings (kWh/HP/year)",{"$f":"_xlfn.IFNA(AVERAGE(IF(((MeasureTable!B9:B536=B5)*(MeasureTable!C9:C536=B9)*(MeasureTable!D9:D536=F14)*(MeasureTable!E9:E536=F16))>0,MeasureTable!R9:R536)),0)","v":0},null,"Min Energy Savings (kWh/HP/year)",{"$f":"_xlfn.IFNA(AVERAGE(IF(((MeasureTable!$B$9:$B$536=B5)*(MeasureTable!$C$9:$C$536=B9)*(MeasureTable!$D$9:$D$536=I14)*(MeasureTable!$E$9:$E$536=I16))>0,MeasureTable!R9:R536)),0)","v":0}]
["Min Cost ($/HP)",{"$f":"IF('General Savings'!D13=\"Yes\",F20,I20)","v":0},null,null,"Min Cost($/HP)",{"$f":"_xlfn.IFNA(AVERAGE(IF(((MeasureTable!B9:B536=B5)*(MeasureTable!C9:C536=B9)*(MeasureTable!D9:D536=F14)*(MeasureTable!E9:E536=F16))>0,MeasureTable!S9:S536)),0)","v":0},null,"Min Cost ($/HP)",{"$f":"_xlfn.IFNA(AVERAGE(IF(((MeasureTable!$B$9:$B$536=B5)*(MeasureTable!C9:C536=B9)*(MeasureTable!D9:D536=I14)*(MeasureTable!E9:E536=I16))>0,MeasureTable!S9:S536)),0)","v":0}]
["User-defined Energy Savings (kWh/HP/year)",{"$f":"IF('General Savings'!D13=\"Yes\",F21,I21)","v":0},null,null,"User-defined Energy Savings (kWh/HP/year)",{"$f":"_xlfn.IFNA(IF('General Savings'!K22<='General_savings Calculations'!F17,(AVERAGE(IF(((MeasureTable!B9:B536=B5)*(MeasureTable!C9:C536=B9)*(MeasureTable!D9:D536=F14)*(MeasureTable!E9:E536='General Savings'!K22))>0,MeasureTable!R9:R536))),(AVERAGE(IF(((MeasureTable!B9:B536=B5)*(MeasureTable!C9:C536=B9)*(MeasureTable!D9:D536=F14)*(MeasureTable!E9:E536=F17))>0,MeasureTable!R9:R536)))/F17*'General Savings'!K22),0)","v":0},null,"User-defined Energy Savings (kWh/HP/year)",{"$f":"_xlfn.IFNA(IF('General Savings'!K22<='General_savings Calculations'!I17,AVERAGE(IF(((MeasureTable!B9:B536=B5)*(MeasureTable!C9:C536=B9)*(MeasureTable!D9:D536=I14)*(MeasureTable!E9:E536='General Savings'!K22))>0,MeasureTable!R9:R536)),(AVERAGE(IF(((MeasureTable!B9:B536=B5)*(MeasureTable!C9:C536=B9)*(MeasureTable!D9:D536=I14)*(MeasureTable!E9:E536='General_savings Calculations'!I17))>0,MeasureTable!R9:R536))/I17*'General Savings'!K22)),0)","v":0}]
["User-defined Cost ($/HP)",{"$f":"IF('General Savings'!D13=\"Yes\",F22,I22)","v":0},null,null,"User-defined Cost ($/HP)",{"$f":"_xlfn.IFNA(IF('General Savings'!K22<='General_savings Calculations'!F17,AVERAGE(IF(((MeasureTable!B9:B536=B5)*(MeasureTable!C9:C536=B9)*(MeasureTable!D9:D536=F14)*(MeasureTable!E9:E536='General Savings'!K22))>0,MeasureTable!S9:S536)),(AVERAGE(IF(((MeasureTable!B9:B536=B5)*(MeasureTable!C9:C536=B9)*(MeasureTable!D9:D536=F14)*(MeasureTable!E9:E536='General_savings Calculations'!F17))>0,MeasureTable!S9:S536))/'General_savings Calculations'!F17*'General Savings'!K22)),0)","v":0},null,"User-defined Cost ($/HP)",{"$f":"_xlfn.IFNA(IF('General Savings'!K22<='General_savings Calculations'!I17,AVERAGE(IF(((MeasureTable!B9:B536=B5)*(MeasureTable!C9:C536=B9)*(MeasureTable!D9:D536=I14)*(MeasureTable!E9:E536='General Savings'!K22))>0,MeasureTable!S9:S536)),AVERAGE(IF(((MeasureTable!B9:B536=B5)*(MeasureTable!C9:C536=B9)*(MeasureTable!D9:D536=I14)*(MeasureTable!E9:E536='General_savings Calculations'!I17))>0,MeasureTable!S9:S536))/'General_savings Calculations'!I17*'General Savings'!K22),0)","v":0}]
["Max Energy Savings (kWh/HP/year)",{"$f":"IF('General Savings'!D13=\"Yes\",F23,I23)","v":0},null,null,"Max Energy Savings (kWh/HP/year)",{"$f":"_xlfn.IFNA((AVERAGE(IF(((MeasureTable!B9:B536=B5)*(MeasureTable!C9:C536=B9)*(MeasureTable!D9:D536=F14)*(MeasureTable!E9:E536=F17))>0,MeasureTable!R9:R536)))/F17*F18,0)","v":0},null,"Max Energy Savings (kWh/HP/year)",{"$f":"_xlfn.IFNA((AVERAGE(IF(((MeasureTable!B9:B536=B5)*(MeasureTable!C9:C536=B9)*(MeasureTable!D9:D536=I14)*(MeasureTable!E9:E536=I17))>0,MeasureTable!R9:R536)))/I17*I18,0)","v":0}]
["Max Cost($/HP)",{"$f":"IF('General Savings'!D13=\"Yes\",F24,I24)","v":0},null,null,"Max Cost($/HP)",{"$f":"_xlfn.IFNA((AVERAGE(IF(((MeasureTable!B9:B536=B5)*(MeasureTable!C9:C536=B9)*(MeasureTable!D9:D536=F14)*(MeasureTable!E9:E536=F17))>0,MeasureTable!S9:S536))/F17*F18),0)","v":0},null,"Max Cost($/HP)",{"$f":"_xlfn.IFNA((AVERAGE(IF(((MeasureTable!B9:B536=B5)*(MeasureTable!C9:C536=B9)*(MeasureTable!D9:D536=I14)*(MeasureTable!E9:E536=I17))>0,MeasureTable!S9:S536))/I17*I18),0)","v":0}]
["Lifetime",{"$f":"IF('General Savings'!D13=\"Yes\",F25,I25)","v":{"$error":"#N/A"}},null,null,"Lifetime",{"$f":"VLOOKUP(B6,Lifetime!$B$3:$C$7,2,FALSE)","v":{"$error":"#N/A"}},null,"Lifetime",{"$f":"VLOOKUP(B6,Lifetime!$B$3:$C$7,2,FALSE)","v":{"$error":"#N/A"}}]
["CS->VS",null,null,null,"CS->VS",null,null,"CS->VS"]
[null,null,null,null,null,"VS",null,null,"VS"]
[null,null,null,null,null,"VSNoCode",null,null,"VSNoCode"]
["MotorHP Bin",null,null,null,"MotorHP Bin",{"$f":"INDEX(Lists!X3:X7,MATCH(F13,Lists!W3:W7,-1))","v":"1 - 1.9 HP"},null,"MotorHP Bin",{"$f":"INDEX(Lists!X3:X7,MATCH('General_savings Calculations'!I13,Lists!W3:W7,-1))","v":"1 - 1.9 HP"}]
["Max Energy Rating from ER DB, CS->VS",null,null,null,"Max Energy Rating from ER DB, CS->VS",{"$f":"_xlfn.IFNA(MAX(IF((('sample-llc'!$A$203:$A$622=\"pump_motor_cc\")*('sample-llc'!$B$203:$B$622=B6)*('sample-llc'!$C$203:$C$622=G5)*('sample-llc'!$D$203:$D$622=G6))>0,'sample-llc'!$G$203:$G$622)),0)","v":0},null,"Max Energy Rating from ER DB, CS->VS",{"$f":"_xlfn.IFNA(MAX(IF((('sample-llc'!$A$2:$A$201=\"variable\")*('sample-llc'!$B$2:$B$201=I13)*('sample-llc'!$C$2:$C$201=B6))>0,'sample-llc'!$D$2:$D$201)),0)","v":0}]
["Min_ER from measures for this combination",{"$f":"IF('General Savings'!D13=\"Yes\",F31,I31)","v":0},null,null,"Min_ER from measures for this combination",{"$f":"_xlfn.IFNA(MIN(IF(((MeasureTable!B9:B536=F28)*(MeasureTable!C9:C536=B9)*(MeasureTable!D9:D536=F29))>0,MeasureTable!E9:E536)),0)","v":0},null,"Min_ER from measures for this combination",{"$f":"_xlfn.IFNA(MIN(IF(((MeasureTable!B9:B536=I28)*(MeasureTable!C9:C536=B9)*(MeasureTable!D9:D536=I29))>0,MeasureTable!E9:E536)),0)","v":0}]
["Max_ER from measures for this combination",null,null,null,"Max_ER from measures for this combination",{"$f":"_xlfn.IFNA(MAX(IF(((MeasureTable!B9:B536=F28)*(MeasureTable!C9:C536=B9)*(MeasureTable!D9:D536=F29))>0,MeasureTable!E9:E536)),0)","v":0},null,"Max_ER from measures for this combination",{"$f":"_xlfn.IFNA(MAX(IF(((MeasureTable!B9:B536=I28)*(MeasureTable!C9:C536=B9)*(MeasureTable!D9:D536=I29))>0,MeasureTable!E9:E536)),0)","v":0}]
["Max_ER for calculations",{"$f":"IF('General Savings'!D13=\"Yes\",F33,I33)","v":0},null,null,"Max_ER for calculations",{"$f":"IF(F30<F31,F32,IF(F30=0,F32,MIN(F30,F32)))","v":0},null,"Max_ER for calculations",{"$f":"IF(I30<I31,I32,IF(I30=0,I32,MIN(I30,I32)))","v":0}]
["User Defined EnergyRating",null,null,null,"User Defined EnergyRating",{"$f":"'General Savings'!K41","v":0},null,"User Defined EnergyRating",{"$f":"'General Savings'!K41","v":0}]
[]
["User-defined Energy Savings (kWh/HP/year)",{"$f":"IF('General Savings'!D13=\"Yes\",F36,I36)","v":{"$error":"#DIV/0!"}},null,null,"User-defined Energy Savings (kWh/HP/year)",{"$f":"_xlfn.IFNA(AVERAGE(IF(((MeasureTable!B9:B536=F28)*(MeasureTable!C9:C536=B9)*(MeasureTable!D9:D536=F29)*(MeasureTable!E9:E536=F34))>0,MeasureTable!R9:R536)),0)","v":{"$error":"#DIV/0!"}},null,"User-defined Energy Savings (kWh/HP/year)",{"$f":"_xlfn.IFNA(AVERAGE(IF(((MeasureTable!B9:B536=I28)*(MeasureTable!C9:C536=B9)*(MeasureTable!D9:D536=I29)*(MeasureTable!E9:E536=I34))>0,MeasureTable!R9:R536)),0)","v":{"$error":"#DIV/0!"}}]
["User-defined Cost ($/HP)",{"$f":"IF('General Savings'!D13=\"Yes\",F37,I37)","v":{"$error":"#DIV/0!"}},null,null,"User-defined Cost ($/HP)",{"$f":"_xlfn.IFNA(AVERAGE(IF(((MeasureTable!B9:B536=F28)*(MeasureTable!C9:C536=B9)*(MeasureTable!D9:D536=F29)*(MeasureTable!E9:E536=F34))>0,MeasureTable!S9:S536)),0)","v":{"$error":"#DIV/0!"}},null,"User-defined Cost ($/HP)",{"$f":"_xlfn.IFNA(AVERAGE(IF(((MeasureTable!B9:B536=I28)*(MeasureTable!C9:C536=B9)*(MeasureTable!D9:D536=I29)*(MeasureTable!E9:E536=I34))>0,MeasureTable!S9:S536)),0)","v":{"$error":"#DIV/0!"}}]
["Max Energy Savings (kWh/HP/year)",{"$f":"IF('General Savings'!D13=\"Yes\",F38,I38)","v":{"$error":"#DIV/0!"}},null,null,"Max Energy Savings (kWh/HP/year)",{"$f":"_xlfn.IFNA(AVERAGE(IF(((MeasureTable!B9:B536=F28)*(MeasureTable!C9:C536=B9)*(MeasureTable!D9:D536=F29)*(MeasureTable!E9:E536=F33))>0,MeasureTable!R9:R536)),0)","v":{"$error":"#DIV/0!"}},null,"Max Energy Savings (kWh/HP/year)",{"$f":"_xlfn.IFNA(AVERAGE(IF(((MeasureTable!B9:B536=I28)*(MeasureTable!C9:C536=B9)*(MeasureTable!D9:D536=I29)*(MeasureTable!E9:E536=I33))>0,MeasureTable!R9:R536)),0)","v":{"$error":"#DIV/0!"}}]
["Max Cost($/HP)",{"$f":"IF('General Savings'!D13=\"Yes\",F39,I39)","v":{"$error":"#DIV/0!"}},null,null,"Max Cost($/HP)",{"$f":"_xlfn.IFNA(AVERAGE(IF(((MeasureTable!B9:B536=F28)*(MeasureTable!C9:C536=B9)*(MeasureTable!D9:D536=F29)*(MeasureTable!E9:E536=F33))>0,MeasureTable!S9:S536)),0)","v":{"$error":"#DIV/0!"}},null,"Max Cost($/HP)",{"$f":"_xlfn.IFNA(AVERAGE(IF(((MeasureTable!B9:B536=I28)*(MeasureTable!C9:C536=B9)*(MeasureTable!D9:D536=I29)*(MeasureTable!E9:E536=I33))>0,MeasureTable!S9:S536)),0)","v":{"$error":"#DIV/0!"}}]
[null,null,null,null,null,{"$f":"IF(AND('General Savings'!$D$13=\"Yes\",'General Savings'!D14<>\"\",'General Savings'!D15<>\"\"),IF(F8=0,\"There are currently no pumps that meet these specific design requirements in the Energy Rating Database. Motor HP will be used to estimate the maximum ER available\",\"There are currently pumps that meet the specified design requirements in the Energy Rating Database\"),\"\")","v":""}]

{"sheet":"MeasureTable","index":7,"n_rows":536,"n_cols":19,"rows_kept":536,"cut":false,"hidden":true,"merged":[]}
["Measure Table"]
[]
["Each measure below represents a unique combination of measure identifiers and the associated energy savings and increase in cost. "]
[]
[]
[]
[]
["Number","Speed Control","Application","HP Bin","ER","ER index","Sector","Ophrs ","MO_Factor","Base_AdjFactor1","Base_Adjfactor2","Efficient Adjustment Factor","Baseline_PEI_1","Baseline_PEI_2","DeltaER","Baseline Energy Consumption (kWh/HP)","Efficient Energy Consumption (kWh/HP)","Energy Savings (kWh/HP/year)","Cost ($/HP)"]
[1,"CS","Commercial HVAC","1 - 2.9 HP",6,1,"Commercial",4000,0.37605304702478665,1.25,1.25,1.25,0.96,0.96,2,2234.2292492136439,2187.6828065216928,46.546442691951142,43.398688628708911]
[2,"CS","Commercial HVAC","1 - 2.9 HP",7,2,"Commercial",4000,0.37605304702478665,1.25,1.25,1.25,0.96,0.96,3,2234.2292492136439,2164.4095851757174,69.819664037926486,65.098032943063373]
[3,"CS","Commercial HVAC","1 - 2.9 HP",8,3,"Commercial",4000,0.37605304702478665,1.25,1.25,1.25,0.96,0.96,4,2234.2292492136439,2141.1363638297416,93.092885383902285,86.797377257417821]
[4,"CS","Commercial HVAC","1 - 2.9 HP",9,4,"Commercial",4000,0.37605304702478665,1.25,1.25,1.25,0.96,0.96,5,2234.2292492136439,2117.8631424837663,116.36610672987763,108.49672157177227]
[5,"CS","Commercial HVAC","1 - 2.9 HP",10,5,"Commercial",4000,0.37605304702478665,1.25,1.25,1.25,0.96,0.96,6,2234.2292492136439,2094.589921137791,139.63932807585297,130.19606588612675]
[6,"CS","Commercial HVAC","1 - 2.9 HP",11,6,"Commercial",4000,0.37605304702478665,1.25,1.25,1.25,0.96,0.96,7,2234.2292492136439,2071.3166997918156,162.91254942182832,151.89541020048119]
[7,"CS","Commercial HVAC","1 - 2.9 HP",12,7,"Commercial",4000,0.37605304702478665,1.25,1.25,1.25,0.96,0.96,8,2234.2292492136439,2048.0434784458403,186.18577076780366,173.59475451483564]
[8,"CS","Commercial HVAC","3 - 19.9 HP",6,1,"Commercial",4000,0.29104193408105666,1.25,1.25,1.25,0.96,0.96,2,2538.6370424425531,2485.7487707249988,52.888271717554289,14.844173456695165]
[9,"CS","Commercial HVAC","3 - 19.9 HP",7,2,"Commercial",4000,0.29104193408105666,1.25,1.25,1.25,0.96,0.96,3,2538.6370424425531,2459.3046348662224,79.332407576330752,22.266260185042746]
[10,"CS","Commercial HVAC","3 - 19.9 HP",8,3,"Commercial",4000,0.29104193408105666,1.25,1.25,1.25,0.96,0.96,4,2538.6370424425531,2432.8604990074459,105.77654343510721,29.68834691339033]
[11,"CS","Commercial HVAC","3 - 19.9 HP",9,4,"Commercial",4000,0.29104193408105666,1.25,1.25,1.25,0.96,0.96,5,2538.6370424425531,2406.4163631486699,132.22067929388322,37.110433641737913]
[12,"CS","Commercial HVAC","3 - 19.9 HP",10,5,"Commercial",4000,0.29104193408105666,1.25,1.25,1.25,0.96,0.96,6,2538.6370424425531,2379.9722272898935,158.66481515265968,44.532520370085493]
[13,"CS","Commercial HVAC","3 - 19.9 HP",11,6,"Commercial",4000,0.29104193408105666,1.25,1.25,1.25,0.96,0.96,7,2538.6370424425531,2353.5280914311165,185.1089510114366,51.95460709843308]
[14,"CS","Commercial HVAC","3 - 19.9 HP",12,7,"Commercial",4000,0.29104193408105666,1.25,1.25,1.25,0.96,0.96,8,2538.6370424425531,2327.0839555723396,211.55308687021352,59.376693826780659]
[15,"CS","Commercial HVAC","20 - 50 HP",6,1,"Commercial",4000,0.23688070518484289,1.25,1.25,1.25,0.96,0.96,2,2732.5775708741148,2675.6488714809034,56.928699393211446,6.2919287482879369]
[16,"CS","Commercial HVAC","20 - 50 HP",7,2,"Commercial",4000,0.23688070518484289,1.25,1.25,1.25,0.96,0.96,3,2732.5775708741148,2647.1845217842979,85.393049089816941,9.4378931224319054]
[17,"CS","Commercial HVAC","20 - 50 HP",8,3,"Commercial",4000,0.23688070518484289,1.25,1.25,1.25,0.96,0.96,4,2732.5775708741148,2618.7201720876928,113.85739878642198,12.583857496575874]
[18,"CS","Commercial HVAC","20 - 50 HP",9,4,"Commercial",4000,0.23688070518484289,1.25,1.25,1.25,0.96,0.96,5,2732.5775708741148,2590.2558223910873,142.32174848302748,15.729821870719842]
[19,"CS","Commercial HVAC","20 - 50 HP",10,5,"Commercial",4000,0.23688070518484289,1.25,1.25,1.25,0.96,0.96,6,2732.5775708741148,2561.7914726944819,170.78609817963297,18.875786244863811]
[20,"CS","Commercial HVAC","20 - 50 HP",11,6,"Commercial",4000,0.23688070518484289,1.25,1.25,1.25,0.96,0.96,7,2732.5775708741148,2533.3271229978764,199.25044787623847,22.021750619007779]
[21,"CS","Commercial HVAC","20 - 50 HP",12,7,"Commercial",4000,0.23688070518484289,1.25,1.25,1.25,0.96,0.96,8,2732.5775708741148,2504.8627733012713,227.71479757284351,25.167714993151748]
[22,"CS","Commercial HVAC","50.1 - 200 HP",6,1,"Commercial",4000,0.17506451625407168,1.25,1.25,1.25,0.96,0.96,2,2953.9289801974205,2892.3887931099734,61.540187087447066,2.3489437481429549]
[23,"CS","Commercial HVAC","50.1 - 200 HP",7,2,"Commercial",4000,0.17506451625407168,1.25,1.25,1.25,0.96,0.96,3,2953.9289801974205,2861.6186995662511,92.310280631169462,3.5234156222144324]
[24,"CS","Commercial HVAC","50.1 - 200 HP",8,3,"Commercial",4000,0.17506451625407168,1.25,1.25,1.25,0.96,0.96,4,2953.9289801974205,2830.8486060225277,123.08037417489277,4.6978874962859098]
[25,"CS","Commercial HVAC","50.1 - 200 HP",9,4,"Commercial",4000,0.17506451625407168,1.25,1.25,1.25,0.96,0.96,5,2953.9289801974205,2800.078512478804,153.85046771861653,5.8723593703573869]
[26,"CS","Commercial HVAC","50.1 - 200 HP",10,5,"Commercial",4000,0.17506451625407168,1.25,1.25,1.25,0.96,0.96,6,2953.9289801974205,2769.3084189350816,184.62056126233892,7.0468312444288648]
[27,"CS","Commercial HVAC","50.1 - 200 HP",11,6,"Commercial",4000,0.17506451625407168,1.25,1.25,1.25,0.96,0.96,7,2953.9289801974205,2738.5383253913578,215.39065480606268,8.2213031185003427]
[28,"CS","Commercial HVAC","50.1 - 200 HP",12,7,"Commercial",4000,0.17506451625407168,1.25,1.25,1.25,0.96,0.96,8,2953.9289801974205,2707.768231847635,246.16074834978554,9.3957749925718197]
[29,"CS","Commercial DHW","1 - 2.9 HP",6,1,"Commercial",6000,0.37605304702478665,1.25,1.25,1.25,0.96,0.96,2,3351.3438738204659,3281.5242097825394,69.819664037926486,43.398688628708911]
[30,"CS","Commercial DHW","1 - 2.9 HP",7,2,"Commercial",6000,0.37605304702478665,1.25,1.25,1.25,0.96,0.96,3,3351.3438738204659,3246.6143777635762,104.72949605688973,65.098032943063373]
[31,"CS","Commercial DHW","1 - 2.9 HP",8,3,"Commercial",6000,0.37605304702478665,1.25,1.25,1.25,0.96,0.96,4,3351.3438738204659,3211.7045457446129,139.63932807585297,86.797377257417821]
[32,"CS","Commercial DHW","1 - 2.9 HP",9,4,"Commercial",6000,0.37605304702478665,1.25,1.25,1.25,0.96,0.96,5,3351.3438738204659,3176.7947137256497,174.54916009481622,108.49672157177227]
[33,"CS","Commercial DHW","1 - 2.9 HP",10,5,"Commercial",6000,0.37605304702478665,1.25,1.25,1.25,0.96,0.96,6,3351.3438738204659,3141.8848817066869,209.458992113779,130.19606588612675]
[34,"CS","Commercial DHW","1 - 2.9 HP",11,6,"Commercial",6000,0.37605304702478665,1.25,1.25,1.25,0.96,0.96,7,3351.3438738204659,3106.9750496877232,244.3688241327427,151.89541020048119]
[35,"CS","Commercial DHW","1 - 2.9 HP",12,7,"Commercial",6000,0.37605304702478665,1.25,1.25,1.25,0.96,0.96,8,3351.3438738204659,3072.0652176687599,279.27865615170595,173.59475451483564]
[36,"CS","Commercial DHW","3 - 19.9 HP",6,1,"Commercial",6000,0.29104193408105666,1.25,1.25,1.25,0.96,0.96,2,3807.9555636638297,3728.623156087499,79.332407576330752,14.844173456695165]
[37,"CS","Commercial DHW","3 - 19.9 HP",7,2,"Commercial",6000,0.29104193408105666,1.25,1.25,1.25,0.96,0.96,3,3807.9555636638297,3688.9569522993343,118.99861136449545,22.266260185042746]
[38,"CS","Commercial DHW","3 - 19.9 HP",8,3,"Commercial",6000,0.29104193408105666,1.25,1.25,1.25,0.96,0.96,4,3807.9555636638297,3649.2907485111691,158.66481515266059,29.68834691339033]
[39,"CS","Commercial DHW","3 - 19.9 HP",9,4,"Commercial",6000,0.29104193408105666,1.25,1.25,1.25,0.96,0.96,5,3807.9555636638297,3609.6245447230049,198.33101894082483,37.110433641737913]
[40,"CS","Commercial DHW","3 - 19.9 HP",10,5,"Commercial",6000,0.29104193408105666,1.25,1.25,1.25,0.96,0.96,6,3807.9555636638297,3569.9583409348397,237.99722272898998,44.532520370085493]
[41,"CS","Commercial DHW","3 - 19.9 HP",11,6,"Commercial",6000,0.29104193408105666,1.25,1.25,1.25,0.96,0.96,7,3807.9555636638297,3530.2921371466746,277.66342651715513,51.95460709843308]
[42,"CS","Commercial DHW","3 - 19.9 HP",12,7,"Commercial",6000,0.29104193408105666,1.25,1.25,1.25,0.96,0.96,8,3807.9555636638297,3490.6259333585099,317.32963030531982,59.376693826780659]
[43,"CS","Commercial DHW","20 - 50 HP",6,1,"Commercial",6000,0.23688070518484289,1.25,1.25,1.25,0.96,0.96,2,4098.8663563111722,4013.4733072213558,85.393049089816486,6.2919287482879369]
[44,"CS","Commercial DHW","20 - 50 HP",7,2,"Commercial",6000,0.23688070518484289,1.25,1.25,1.25,0.96,0.96,3,4098.8663563111722,3970.7767826764475,128.08957363472473,9.4378931224319054]
[45,"CS","Commercial DHW","20 - 50 HP",8,3,"Commercial",6000,0.23688070518484289,1.25,1.25,1.25,0.96,0.96,4,4098.8663563111722,3928.0802581315397,170.78609817963252,12.583857496575874]
[46,"CS","Commercial DHW","20 - 50 HP",9,4,"Commercial",6000,0.23688070518484289,1.25,1.25,1.25,0.96,0.96,5,4098.8663563111722,3885.3837335866315,213.48262272454076,15.729821870719842]
[47,"CS","Commercial DHW","20 - 50 HP",10,5,"Commercial",6000,0.23688070518484289,1.25,1.25,1.25,0.96,0.96,6,4098.8663563111722,3842.6872090417232,256.179147269449,18.875786244863811]
[48,"CS","Commercial DHW","20 - 50 HP",11,6,"Commercial",6000,0.23688070518484289,1.25,1.25,1.25,0.96,0.96,7,4098.8663563111722,3799.9906844968154,298.87567181435679,22.021750619007779]
[49,"CS","Commercial DHW","20 - 50 HP",12,7,"Commercial",6000,0.23688070518484289,1.25,1.25,1.25,0.96,0.96,8,4098.8663563111722,3757.2941599519072,341.57219635926504,25.167714993151748]
[50,"CS","Commercial DHW","50.1 - 200 HP",6,1,"Commercial",6000,0.17506451625407168,1.25,1.25,1.25,0.96,0.96,2,4430.8934702961305,4338.5831896649606,92.310280631169917,2.3489437481429549]
[51,"CS","Commercial DHW","50.1 - 200 HP",7,2,"Commercial",6000,0.17506451625407168,1.25,1.25,1.25,0.96,0.96,3,4430.8934702961305,4292.4280493493752,138.46542094675533,3.5234156222144324]
[52,"CS","Commercial DHW","50.1 - 200 HP",8,3,"Commercial",6000,0.17506451625407168,1.25,1.25,1.25,0.96,0.96,4,4430.8934702961305,4246.2729090337907,184.62056126233983,4.6978874962859098]
[53,"CS","Commercial DHW","50.1 - 200 HP",9,4,"Commercial",6000,0.17506451625407168,1.25,1.25,1.25,0.96,0.96,5,4430.8934702961305,4200.1177687182062,230.77570157792434,5.8723593703573869]
[54,"CS","Commercial DHW","50.1 - 200 HP",10,5,"Commercial",6000,0.17506451625407168,1.25,1.25,1.25,0.96,0.96,6,4430.8934702961305,4153.9626284026217,276.93084189350884,7.0468312444288648]
[55,"CS","Commercial DHW","50.1 - 200 HP",11,6,"Commercial",6000,0.17506451625407168,1.25,1.25,1.25,0.96,0.96,7,4430.8934702961305,4107.8074880870372,323.08598220909334,8.2213031185003427]
[56,"CS","Commercial DHW","50.1 - 200 HP",12,7,"Commercial",6000,0.17506451625407168,1.25,1.25,1.25,0.96,0.96,8,4430.8934702961305,4061.6523477714527,369.24112252467785,9.3957749925718197]
[57,"CS","Municipal","1 - 2.9 HP",6,1,"Municipal",3400,0.37605304702478665,0.84,0.84,0.84,0.96,0.96,2,1276.1917471508332,1249.604419085191,26.587328065642168,43.398688628708911]
[58,"CS","Municipal","1 - 2.9 HP",7,2,"Municipal",3400,0.37605304702478665,0.84,0.84,0.84,0.96,0.96,3,1276.1917471508332,1236.3107550523698,39.880992098463366,65.098032943063373]
[59,"CS","Municipal","1 - 2.9 HP",8,3,"Municipal",3400,0.37605304702478665,0.84,0.84,0.84,0.96,0.96,4,1276.1917471508332,1223.0170910195486,53.174656131284564,86.797377257417821]
[60,"CS","Municipal","1 - 2.9 HP",9,4,"Municipal",3400,0.37605304702478665,0.84,0.84,0.84,0.96,0.96,5,1276.1917471508332,1209.7234269867274,66.468320164105762,108.49672157177227]
[61,"CS","Municipal","1 - 2.9 HP",10,5,"Municipal",3400,0.37605304702478665,0.84,0.84,0.84,0.96,0.96,6,1276.1917471508332,1196.4297629539062,79.76198419692696,130.19606588612675]
[62,"CS","Municipal","1 - 2.9 HP",11,6,"Municipal",3400,0.37605304702478665,0.84,0.84,0.84,0.96,0.96,7,1276.1917471508332,1183.136098921085,93.055648229748158,151.89541020048119]
[63,"CS","Municipal","1 - 2.9 HP",12,7,"Municipal",3400,0.37605304702478665,0.84,0.84,0.84,0.96,0.96,8,1276.1917471508332,1169.8424348882638,106.34931226256936,173.59475451483564]
[64,"CS","Municipal","3 - 19.9 HP",6,1,"Municipal",3400,0.29104193408105666,0.84,0.84,0.84,0.96,0.96,2,1450.0694786431859,1419.8596978381195,30.20978080506643,14.844173456695165]
[65,"CS","Municipal","3 - 19.9 HP",7,2,"Municipal",3400,0.29104193408105666,0.84,0.84,0.84,0.96,0.96,3,1450.0694786431859,1404.7548074355864,45.314671207599531,22.266260185042746]
[66,"CS","Municipal","3 - 19.9 HP",8,3,"Municipal",3400,0.29104193408105666,0.84,0.84,0.84,0.96,0.96,4,1450.0694786431859,1389.649917033053,60.41956161013286,29.68834691339033]
[67,"CS","Municipal","3 - 19.9 HP",9,4,"Municipal",3400,0.29104193408105666,0.84,0.84,0.84,0.96,0.96,5,1450.0694786431859,1374.5450266305199,75.524452012665961,37.110433641737913]
[68,"CS","Municipal","3 - 19.9 HP",10,5,"Municipal",3400,0.29104193408105666,0.84,0.84,0.84,0.96,0.96,6,1450.0694786431859,1359.4401362279868,90.629342415199062,44.532520370085493]
[69,"CS","Municipal","3 - 19.9 HP",11,6,"Municipal",3400,0.29104193408105666,0.84,0.84,0.84,0.96,0.96,7,1450.0694786431859,1344.3352458254537,105.73423281773216,51.95460709843308]
[70,"CS","Municipal","3 - 19.9 HP",12,7,"Municipal",3400,0.29104193408105666,0.84,0.84,0.84,0.96,0.96,8,1450.0694786431859,1329.2303554229204,120.83912322026549,59.376693826780659]
[71,"CS","Municipal","20 - 50 HP",6,1,"Municipal",3400,0.23688070518484289,0.84,0.84,0.84,0.96,0.96,2,1560.8483084832942,1528.330635389892,32.517673093402209,6.2919287482879369]
[72,"CS","Municipal","20 - 50 HP",7,2,"Municipal",3400,0.23688070518484289,0.84,0.84,0.84,0.96,0.96,3,1560.8483084832942,1512.0717988431911,48.776509640103086,9.4378931224319054]
[73,"CS","Municipal","20 - 50 HP",8,3,"Municipal",3400,0.23688070518484289,0.84,0.84,0.84,0.96,0.96,4,1560.8483084832942,1495.81296229649,65.03534618680419,12.583857496575874]
[74,"CS","Municipal","20 - 50 HP",9,4,"Municipal",3400,0.23688070518484289,0.84,0.84,0.84,0.96,0.96,5,1560.8483084832942,1479.5541257497891,81.294182733505068,15.729821870719842]
[75,"CS","Municipal","20 - 50 HP",10,5,"Municipal",3400,0.23688070518484289,0.84,0.84,0.84,0.96,0.96,6,1560.8483084832942,1463.2952892030883,97.553019280205945,18.875786244863811]
[76,"CS","Municipal","20 - 50 HP",11,6,"Municipal",3400,0.23688070518484289,0.84,0.84,0.84,0.96,0.96,7,1560.8483084832942,1447.0364526563874,113.81185582690682,22.021750619007779]
[77,"CS","Municipal","20 - 50 HP",12,7,"Municipal",3400,0.23688070518484289,0.84,0.84,0.84,0.96,0.96,8,1560.8483084832942,1430.7776161096863,130.07069237360793,25.167714993151748]
[78,"CS","Municipal","50.1 - 200 HP",6,1,"Municipal",3400,0.17506451625407168,0.84,0.84,0.84,0.96,0.96,2,1687.2842334887664,1652.1324786244168,35.151754864349641,2.3489437481429549]
[79,"CS","Municipal","50.1 - 200 HP",7,2,"Municipal",3400,0.17506451625407168,0.84,0.84,0.84,0.96,0.96,3,1687.2842334887664,1634.5566011922424,52.727632296524007,3.5234156222144324]
[80,"CS","Municipal","50.1 - 200 HP",8,3,"Municipal",3400,0.17506451625407168,0.84,0.84,0.84,0.96,0.96,4,1687.2842334887664,1616.9807237600678,70.3035097286986,4.6978874962859098]
[81,"CS","Municipal","50.1 - 200 HP",9,4,"Municipal",3400,0.17506451625407168,0.84,0.84,0.84,0.96,0.96,5,1687.2842334887664,1599.404846327893,87.879387160873421,5.8723593703573869]
[82,"CS","Municipal","50.1 - 200 HP",10,5,"Municipal",3400,0.17506451625407168,0.84,0.84,0.84,0.96,0.96,6,1687.2842334887664,1581.8289688957184,105.45526459304801,7.0468312444288648]
[83,"CS","Municipal","50.1 - 200 HP",11,6,"Municipal",3400,0.17506451625407168,0.84,0.84,0.84,0.96,0.96,7,1687.2842334887664,1564.2530914635436,123.03114202522283,8.2213031185003427]
[84,"CS","Municipal","50.1 - 200 HP",12,7,"Municipal",3400,0.17506451625407168,0.84,0.84,0.84,0.96,0.96,8,1687.2842334887664,1546.677214031369,140.60701945739743,9.3957749925718197]
[85,"CS","Industrial BFW","1 - 2.9 HP",6,1,"Industrial",4000,0.37605304702478665,1.31,1.31,1.31,0.96,0.96,2,2341.4722531758994,2292.6915812347343,48.78067194116511,43.398688628708911]
[86,"CS","Industrial BFW","1 - 2.9 HP",7,2,"Industrial",4000,0.37605304702478665,1.31,1.31,1.31,0.96,0.96,3,2341.4722531758994,2268.3012452641519,73.171007911747438,65.098032943063373]
[87,"CS","Industrial BFW","1 - 2.9 HP",8,3,"Industrial",4000,0.37605304702478665,1.31,1.31,1.31,0.96,0.96,4,2341.4722531758994,2243.9109092935691,97.56134388233022,86.797377257417821]
[88,"CS","Industrial BFW","1 - 2.9 HP",9,4,"Industrial",4000,0.37605304702478665,1.31,1.31,1.31,0.96,0.96,5,2341.4722531758994,2219.5205733229873,121.95167985291209,108.49672157177227]
[89,"CS","Industrial BFW","1 - 2.9 HP",10,5,"Industrial",4000,0.37605304702478665,1.31,1.31,1.31,0.96,0.96,6,2341.4722531758994,2195.1302373524049,146.34201582349442,130.19606588612675]
[90,"CS","Industrial BFW","1 - 2.9 HP",11,6,"Industrial",4000,0.37605304702478665,1.31,1.31,1.31,0.96,0.96,7,2341.4722531758994,2170.7399013818231,170.73235179407629,151.89541020048119]
[91,"CS","Industrial BFW","1 - 2.9 HP",12,7,"Industrial",4000,0.37605304702478665,1.31,1.31,1.31,0.96,0.96,8,2341.4722531758994,2146.3495654112407,195.12268776465862,173.59475451483564]
[92,"CS","Industrial BFW","3 - 19.9 HP",6,1,"Industrial",4000,0.29104193408105666,1.31,1.31,1.31,0.96,0.96,2,2660.4916204797955,2605.0647117197991,55.426908759996422,14.844173456695165]
[93,"CS","Industrial BFW","3 - 19.9 HP",7,2,"Industrial",4000,0.29104193408105666,1.31,1.31,1.31,0.96,0.96,3,2660.4916204797955,2577.3512573398011,83.140363139994406,22.266260185042746]
[94,"CS","Industrial BFW","3 - 19.9 HP",8,3,"Industrial",4000,0.29104193408105666,1.31,1.31,1.31,0.96,0.96,4,2660.4916204797955,2549.6378029598036,110.85381751999194,29.68834691339033]
[95,"CS","Industrial BFW","3 - 19.9 HP",9,4,"Industrial",4000,0.29104193408105666,1.31,1.31,1.31,0.96,0.96,5,2660.4916204797955,2521.9243485798061,138.56727189998946,37.110433641737913]
[96,"CS","Industrial BFW","3 - 19.9 HP",10,5,"Industrial",4000,0.29104193408105666,1.31,1.31,1.31,0.96,0.96,6,2660.4916204797955,2494.2108941998081,166.28072627998745,44.532520370085493]
[97,"CS","Industrial BFW","3 - 19.9 HP",11,6,"Industrial",4000,0.29104193408105666,1.31,1.31,1.31,0.96,0.96,7,2660.4916204797955,2466.4974398198101,193.99418065998543,51.95460709843308]
[98,"CS","Industrial BFW","3 - 19.9 HP",12,7,"Industrial",4000,0.29104193408105666,1.31,1.31,1.31,0.96,0.96,8,2660.4916204797955,2438.7839854398121,221.70763503998342,59.376693826780659]
[99,"CS","Industrial BFW","20 - 50 HP",6,1,"Industrial",4000,0.23688070518484289,1.31,1.31,1.31,0.96,0.96,2,2863.7412942760725,2804.0800173119869,59.661276964085573,6.2919287482879369]
[100,"CS","Industrial BFW","20 - 50 HP",7,2,"Industrial",4000,0.23688070518484289,1.31,1.31,1.31,0.96,0.96,3,2863.7412942760725,2774.2493788299444,89.491915446128132,9.4378931224319054]
[101,"CS","Industrial BFW","20 - 50 HP",8,3,"Industrial",4000,0.23688070518484289,1.31,1.31,1.31,0.96,0.96,4,2863.7412942760725,2744.4187403479023,119.32255392817024,12.583857496575874]
[102,"CS","Industrial BFW","20 - 50 HP",9,4,"Industrial",4000,0.23688070518484289,1.31,1.31,1.31,0.96,0.96,5,2863.7412942760725,2714.5881018658597,149.1531924102128,15.729821870719842]
[103,"CS","Industrial BFW","20 - 50 HP",10,5,"Industrial",4000,0.23688070518484289,1.31,1.31,1.31,0.96,0.96,6,2863.7412942760725,2684.7574633838171,178.98383089225536,18.875786244863811]
[104,"CS","Industrial BFW","20 - 50 HP",11,6,"Industrial",4000,0.23688070518484289,1.31,1.31,1.31,0.96,0.96,7,2863.7412942760725,2654.9268249017746,208.81446937429791,22.021750619007779]
[105,"CS","Industrial BFW","20 - 50 HP",12,7,"Industrial",4000,0.23688070518484289,1.31,1.31,1.31,0.96,0.96,8,2863.7412942760725,2625.0961864197325,238.64510785634002,25.167714993151748]
[106,"CS","Industrial BFW","50.1 - 200 HP",6,1,"Industrial",4000,0.17506451625407168,1.31,1.31,1.31,0.96,0.96,2,3095.717571246897,3031.2234551792521,64.494116067644882,2.3489437481429549]
[107,"CS","Industrial BFW","50.1 - 200 HP",7,2,"Industrial",4000,0.17506451625407168,1.31,1.31,1.31,0.96,0.96,3,3095.717571246897,2998.9763971454308,96.741174101466186,3.5234156222144324]
[108,"CS","Industrial BFW","50.1 - 200 HP",8,3,"Industrial",4000,0.17506451625407168,1.31,1.31,1.31,0.96,0.96,4,3095.717571246897,2966.7293391116091,128.98823213528794,4.6978874962859098]
[109,"CS","Industrial BFW","50.1 - 200 HP",9,4,"Industrial",4000,0.17506451625407168,1.31,1.31,1.31,0.96,0.96,5,3095.717571246897,2934.4822810777869,161.23529016911016,5.8723593703573869]
[110,"CS","Industrial BFW","50.1 - 200 HP",10,5,"Industrial",4000,0.17506451625407168,1.31,1.31,1.31,0.96,0.96,6,3095.717571246897,2902.2352230439656,193.48234820293146,7.0468312444288648]
[111,"CS","Industrial BFW","50.1 - 200 HP",11,6,"Industrial",4000,0.17506451625407168,1.31,1.31,1.31,0.96,0.96,7,3095.717571246897,2869.9881650101433,225.72940623675368,8.2213031185003427]
[112,"CS","Industrial BFW","50.1 - 200 HP",12,7,"Industrial",4000,0.17506451625407168,1.31,1.31,1.31,0.96,0.96,8,3095.717571246897,2837.7411069763216,257.97646427057543,9.3957749925718197]
[113,"CS","Industrial General","1 - 2.9 HP",6,1,"Industrial",6800,0.37605304702478665,1.31,1.31,1.31,0.96,0.96,2,3980.5028303990289,3897.575688099048,82.927142299980915,43.398688628708911]
[114,"CS","Industrial General","1 - 2.9 HP",7,2,"Industrial",6800,0.37605304702478665,1.31,1.31,1.31,0.96,0.96,3,3980.5028303990289,3856.1121169490584,124.39071344997046,65.098032943063373]
[115,"CS","Industrial General","1 - 2.9 HP",8,3,"Industrial",6800,0.37605304702478665,1.31,1.31,1.31,0.96,0.96,4,3980.5028303990289,3814.6485457990684,165.85428459996047,86.797377257417821]
[116,"CS","Industrial General","1 - 2.9 HP",9,4,"Industrial",6800,0.37605304702478665,1.31,1.31,1.31,0.96,0.96,5,3980.5028303990289,3773.1849746490784,207.31785574995047,108.49672157177227]
[117,"CS","Industrial General","1 - 2.9 HP",10,5,"Industrial",6800,0.37605304702478665,1.31,1.31,1.31,0.96,0.96,6,3980.5028303990289,3731.7214034990889,248.78142689994002,130.19606588612675]
[118,"CS","Industrial General","1 - 2.9 HP",11,6,"Industrial",6800,0.37605304702478665,1.31,1.31,1.31,0.96,0.96,7,3980.5028303990289,3690.2578323490989,290.24499804993002,151.89541020048119]
[119,"CS","Industrial General","1 - 2.9 HP",12,7,"Industrial",6800,0.37605304702478665,1.31,1.31,1.31,0.96,0.96,8,3980.5028303990289,3648.7942611991084,331.70856919992048,173.59475451483564]
[120,"CS","Industrial General","3 - 19.9 HP",6,1,"Industrial",6800,0.29104193408105666,1.31,1.31,1.31,0.96,0.96,2,4522.8357548156528,4428.6100099236592,94.2257448919936,14.844173456695165]
[121,"CS","Industrial General","3 - 19.9 HP",7,2,"Industrial",6800,0.29104193408105666,1.31,1.31,1.31,0.96,0.96,3,4522.8357548156528,4381.4971374776633,141.33861733798949,22.266260185042746]
[122,"CS","Industrial General","3 - 19.9 HP",8,3,"Industrial",6800,0.29104193408105666,1.31,1.31,1.31,0.96,0.96,4,4522.8357548156528,4334.3842650316656,188.4514897839872,29.68834691339033]
[123,"CS","Industrial General","3 - 19.9 HP",9,4,"Industrial",6800,0.29104193408105666,1.31,1.31,1.31,0.96,0.96,5,4522.8357548156528,4287.2713925856697,235.56436222998309,37.110433641737913]
[124,"CS","Industrial General","3 - 19.9 HP",10,5,"Industrial",6800,0.29104193408105666,1.31,1.31,1.31,0.96,0.96,6,4522.8357548156528,4240.1585201396729,282.67723467597989,44.532520370085493]
[125,"CS","Industrial General","3 - 19.9 HP",11,6,"Industrial",6800,0.29104193408105666,1.31,1.31,1.31,0.96,0.96,7,4522.8357548156528,4193.045647693677,329.79010712197578,51.95460709843308]
[126,"CS","Industrial General","3 - 19.9 HP",12,7,"Industrial",6800,0.29104193408105666,1.31,1.31,1.31,0.96,0.96,8,4522.8357548156528,4145.9327752476811,376.90297956797167,59.376693826780659]
[127,"CS","Industrial General","20 - 50 HP",6,1,"Industrial",6800,0.23688070518484289,1.31,1.31,1.31,0.96,0.96,2,4868.3602002693233,4766.9360294303779,101.42417083894543,6.2919287482879369]
[128,"CS","Industrial General","20 - 50 HP",7,2,"Industrial",6800,0.23688070518484289,1.31,1.31,1.31,0.96,0.96,3,4868.3602002693233,4716.2239440109061,152.13625625841723,9.4378931224319054]
[129,"CS","Industrial General","20 - 50 HP",8,3,"Industrial",6800,0.23688070518484289,1.31,1.31,1.31,0.96,0.96,4,4868.3602002693233,4665.5118585914342,202.84834167788904,12.583857496575874]
[130,"CS","Industrial General","20 - 50 HP",9,4,"Industrial",6800,0.23688070518484289,1.31,1.31,1.31,0.96,0.96,5,4868.3602002693233,4614.7997731719624,253.56042709736084,15.729821870719842]
[131,"CS","Industrial General","20 - 50 HP",10,5,"Industrial",6800,0.23688070518484289,1.31,1.31,1.31,0.96,0.96,6,4868.3602002693233,4564.0876877524897,304.27251251683356,18.875786244863811]
[132,"CS","Industrial General","20 - 50 HP",11,6,"Industrial",6800,0.23688070518484289,1.31,1.31,1.31,0.96,0.96,7,4868.3602002693233,4513.3756023330179,354.98459793630536,22.021750619007779]
[133,"CS","Industrial General","20 - 50 HP",12,7,"Industrial",6800,0.23688070518484289,1.31,1.31,1.31,0.96,0.96,8,4868.3602002693233,4462.6635169135452,405.69668335577808,25.167714993151748]
[134,"CS","Industrial General","50.1 - 200 HP",6,1,"Industrial",6800,0.17506451625407168,1.31,1.31,1.31,0.96,0.96,2,5262.7198711197252,5153.0798738047288,109.63999731499644,2.3489437481429549]
[135,"CS","Industrial General","50.1 - 200 HP",7,2,"Industrial",6800,0.17506451625407168,1.31,1.31,1.31,0.96,0.96,3,5262.7198711197252,5098.2598751472324,164.45999597249283,3.5234156222144324]
[136,"CS","Industrial General","50.1 - 200 HP",8,3,"Industrial",6800,0.17506451625407168,1.31,1.31,1.31,0.96,0.96,4,5262.7198711197252,5043.439876489736,219.27999462998923,4.6978874962859098]
[137,"CS","Industrial General","50.1 - 200 HP",9,4,"Industrial",6800,0.17506451625407168,1.31,1.31,1.31,0.96,0.96,5,5262.7198711197252,4988.6198778322378,274.09999328748745,5.8723593703573869]
[138,"CS","Industrial General","50.1 - 200 HP",10,5,"Industrial",6800,0.17506451625407168,1.31,1.31,1.31,0.96,0.96,6,5262.7198711197252,4933.7998791747414,328.91999194498385,7.0468312444288648]
[139,"CS","Industrial General","50.1 - 200 HP",11,6,"Industrial",6800,0.17506451625407168,1.31,1.31,1.31,0.96,0.96,7,5262.7198711197252,4878.9798805172441,383.73999060248116,8.2213031185003427]
[140,"CS","Industrial General","50.1 - 200 HP",12,7,"Industrial",6800,0.17506451625407168,1.31,1.31,1.31,0.96,0.96,8,5262.7198711197252,4824.1598818597467,438.55998925997847,9.3957749925718197]
[141,"CS","Agricultural","1 - 2.9 HP",6,1,"Agricultural",2400,0.37605304702478665,1.325,1.325,1.325,0.96,0.96,2,1420.9698024998772,1391.3662649477967,29.603537552080525,43.398688628708911]
[142,"CS","Agricultural","1 - 2.9 HP",7,2,"Agricultural",2400,0.37605304702478665,1.325,1.325,1.325,0.96,0.96,3,1420.9698024998772,1376.5644961717564,44.405306328120787,65.098032943063373]
[143,"CS","Agricultural","1 - 2.9 HP",8,3,"Agricultural",2400,0.37605304702478665,1.325,1.325,1.325,0.96,0.96,4,1420.9698024998772,1361.7627273957157,59.207075104161504,86.797377257417821]
[144,"CS","Agricultural","1 - 2.9 HP",9,4,"Agricultural",2400,0.37605304702478665,1.325,1.325,1.325,0.96,0.96,5,1420.9698024998772,1346.9609586196755,74.008843880201766,108.49672157177227]
[145,"CS","Agricultural","1 - 2.9 HP",10,5,"Agricultural",2400,0.37605304702478665,1.325,1.325,1.325,0.96,0.96,6,1420.9698024998772,1332.159189843635,88.810612656242256,130.19606588612675]
[146,"CS","Agricultural","1 - 2.9 HP",11,6,"Agricultural",2400,0.37605304702478665,1.325,1.325,1.325,0.96,0.96,7,1420.9698024998772,1317.3574210675947,103.61238143228252,151.89541020048119]
[147,"CS","Agricultural","1 - 2.9 HP",12,7,"Agricultural",2400,0.37605304702478665,1.325,1.325,1.325,0.96,0.96,8,1420.9698024998772,1302.5556522915542,118.41415020832301,173.59475451483564]
[148,"CS","Agricultural","3 - 19.9 HP",6,1,"Agricultural",2400,0.29104193408105666,1.325,1.325,1.325,0.96,0.96,2,1614.5731589934635,1580.9362181810998,33.636940812363719,14.844173456695165]
[149,"CS","Agricultural","3 - 19.9 HP",7,2,"Agricultural",2400,0.29104193408105666,1.325,1.325,1.325,0.96,0.96,3,1614.5731589934635,1564.1177477749177,50.455411218545805,22.266260185042746]
[150,"CS","Agricultural","3 - 19.9 HP",8,3,"Agricultural",2400,0.29104193408105666,1.325,1.325,1.325,0.96,0.96,4,1614.5731589934635,1547.2992773687358,67.273881624727665,29.68834691339033]
[151,"CS","Agricultural","3 - 19.9 HP",9,4,"Agricultural",2400,0.29104193408105666,1.325,1.325,1.325,0.96,0.96,5,1614.5731589934635,1530.4808069625535,84.092352030909979,37.110433641737913]
[152,"CS","Agricultural","3 - 19.9 HP",10,5,"Agricultural",2400,0.29104193408105666,1.325,1.325,1.325,0.96,0.96,6,1614.5731589934635,1513.6623365563719,100.91082243709161,44.532520370085493]
[153,"CS","Agricultural","3 - 19.9 HP",11,6,"Agricultural",2400,0.29104193408105666,1.325,1.325,1.325,0.96,0.96,7,1614.5731589934635,1496.84386615019,117.72929284327347,51.95460709843308]
[154,"CS","Agricultural","3 - 19.9 HP",12,7,"Agricultural",2400,0.29104193408105666,1.325,1.325,1.325,0.96,0.96,8,1614.5731589934635,1480.0253957440082,134.54776324945533,59.376693826780659]
[155,"CS","Agricultural","20 - 50 HP",6,1,"Agricultural",2400,0.23688070518484289,1.325,1.325,1.325,0.96,0.96,2,1737.9193350759369,1701.7126822618548,36.20665281408219,6.2919287482879369]
[156,"CS","Agricultural","20 - 50 HP",7,2,"Agricultural",2400,0.23688070518484289,1.325,1.325,1.325,0.96,0.96,3,1737.9193350759369,1683.6093558548137,54.309979221123285,9.4378931224319054]
[157,"CS","Agricultural","20 - 50 HP",8,3,"Agricultural",2400,0.23688070518484289,1.325,1.325,1.325,0.96,0.96,4,1737.9193350759369,1665.5060294477726,72.41330562816438,12.583857496575874]
[158,"CS","Agricultural","20 - 50 HP",9,4,"Agricultural",2400,0.23688070518484289,1.325,1.325,1.325,0.96,0.96,5,1737.9193350759369,1647.4027030407317,90.516632035205248,15.729821870719842]
[159,"CS","Agricultural","20 - 50 HP",10,5,"Agricultural",2400,0.23688070518484289,1.325,1.325,1.325,0.96,0.96,6,1737.9193350759369,1629.2993766336906,108.61995844224634,18.875786244863811]
[160,"CS","Agricultural","20 - 50 HP",11,6,"Agricultural",2400,0.23688070518484289,1.325,1.325,1.325,0.96,0.96,7,1737.9193350759369,1611.1960502266495,126.72328484928744,22.021750619007779]
[161,"CS","Agricultural","20 - 50 HP",12,7,"Agricultural",2400,0.23688070518484289,1.325,1.325,1.325,0.96,0.96,8,1737.9193350759369,1593.0927238196089,144.82661125632808,25.167714993151748]
[162,"CS","Agricultural","50.1 - 200 HP",6,1,"Agricultural",2400,0.17506451625407168,1.325,1.325,1.325,0.96,0.96,2,1878.6988314055591,1839.5592724179432,39.139558987615828,2.3489437481429549]
[163,"CS","Agricultural","50.1 - 200 HP",7,2,"Agricultural",2400,0.17506451625407168,1.325,1.325,1.325,0.96,0.96,3,1878.6988314055591,1819.9894929241354,58.709338481423629,3.5234156222144324]
[164,"CS","Agricultural","50.1 - 200 HP",8,3,"Agricultural",2400,0.17506451625407168,1.325,1.325,1.325,0.96,0.96,4,1878.6988314055591,1800.4197134303272,78.279117975231884,4.6978874962859098]
[165,"CS","Agricultural","50.1 - 200 HP",9,4,"Agricultural",2400,0.17506451625407168,1.325,1.325,1.325,0.96,0.96,5,1878.6988314055591,1780.8499339365194,97.848897469039684,5.8723593703573869]
[166,"CS","Agricultural","50.1 - 200 HP",10,5,"Agricultural",2400,0.17506451625407168,1.325,1.325,1.325,0.96,0.96,6,1878.6988314055591,1761.2801544427116,117.41867696284748,7.0468312444288648]
[167,"CS","Agricultural","50.1 - 200 HP",11,6,"Agricultural",2400,0.17506451625407168,1.325,1.325,1.325,0.96,0.96,7,1878.6988314055591,1741.7103749489038,136.98845645665529,8.2213031185003427]
[168,"CS","Agricultural","50.1 - 200 HP",12,7,"Agricultural",2400,0.17506451625407168,1.325,1.325,1.325,0.96,0.96,8,1878.6988314055591,1722.1405954550958,156.55823595046331,9.3957749925718197]
[169,"VSCode","Commercial HVAC","1 - 1.9 HP",44.000000000000007,1,"Commercial",4000,0.39003439574594323,1,1,1,0.57999999999999996,0.57999999999999996,2,1055.679670594581,1019.2769233326987,36.402747261882269,66.945132000000001]
[170,"VSCode","Commercial HVAC","1 - 1.9 HP",45.000000000000007,2,"Commercial",4000,0.39003439574594323,1,1,1,0.57999999999999996,0.57999999999999996,3,1055.679670594581,1001.0755497017577,54.604120892823289,100.417698]
[171,"VSCode","Commercial HVAC","1 - 1.9 HP",46.000000000000007,3,"Commercial",4000,0.39003439574594323,1,1,1,0.57999999999999996,0.57999999999999996,4,1055.679670594581,982.87417607081682,72.805494523764196,133.890264]
[172,"VSCode","Commercial HVAC","1 - 1.9 HP",47.000000000000007,4,"Commercial",4000,0.39003439574594323,1,1,1,0.57999999999999996,0.57999999999999996,5,1055.679670594581,964.67280243987568,91.00686815470533,167.36283]
[173,"VSCode","Commercial HVAC","1 - 1.9 HP",48.000000000000007,5,"Commercial",4000,0.39003439574594323,1,1,1,0.57999999999999996,0.57999999999999996,6,1055.679670594581,946.47142880893466,109.20824178564635,200.835396]
[174,"VSCode","Commercial HVAC","1 - 1.9 HP",49.000000000000007,6,"Commercial",4000,0.39003439574594323,1,1,1,0.57999999999999996,0.57999999999999996,7,1055.679670594581,928.27005517799353,127.40961541658749,234.307962]
[175,"VSCode","Commercial HVAC","2 - 2.9 HP",45.000000000000007,1,"Commercial",4000,0.36520827043091608,1,1,1,0.56999999999999995,0.56999999999999995,2,1079.7045569894635,1041.8201865687802,37.884370420683354,35.97384000000001]
[176,"VSCode","Commercial HVAC","2 - 2.9 HP",46.000000000000007,2,"Commercial",4000,0.36520827043091608,1,1,1,0.56999999999999995,0.56999999999999995,3,1079.7045569894635,1022.8780013584388,56.826555631024689,53.960760000000015]
[177,"VSCode","Commercial HVAC","2 - 2.9 HP",47.000000000000007,3,"Commercial",4000,0.36520827043091608,1,1,1,0.56999999999999995,0.56999999999999995,4,1079.7045569894635,1003.9358161480975,75.768740841366025,71.94768000000002]
[178,"VSCode","Commercial HVAC","2 - 2.9 HP",48.000000000000007,4,"Commercial",4000,0.36520827043091608,1,1,1,0.56999999999999995,0.56999999999999995,5,1079.7045569894635,984.99363093775582,94.710926051707702,89.934600000000017]
[179,"VSCode","Commercial HVAC","2 - 2.9 HP",49.000000000000007,5,"Commercial",4000,0.36520827043091608,1,1,1,0.56999999999999995,0.56999999999999995,6,1079.7045569894635,966.05144572741449,113.65311126204904,107.92152000000003]
[180,"VSCode","Commercial HVAC","2 - 2.9 HP",50.000000000000007,6,"Commercial",4000,0.36520827043091608,1,1,1,0.56999999999999995,0.56999999999999995,7,1079.7045569894635,947.10926051707304,132.59529647239049,125.90844000000004]
[181,"VSCode","Commercial HVAC","3 - 5.9 HP",46.999999999999993,1,"Commercial",4000,0.33664183851667306,1,1,1,0.55000000000000004,0.55000000000000004,2,1088.7034146264364,1049.1141995491112,39.589215077325207,20.088396000000007]
[182,"VSCode","Commercial HVAC","3 - 5.9 HP",47.999999999999993,2,"Commercial",4000,0.33664183851667306,1,1,1,0.55000000000000004,0.55000000000000004,3,1088.7034146264364,1029.3195920104488,59.383822615987583,30.132594000000012]
[183,"VSCode","Commercial HVAC","3 - 5.9 HP",48.999999999999993,3,"Commercial",4000,0.33664183851667306,1,1,1,0.55000000000000004,0.55000000000000004,4,1088.7034146264364,1009.5249844717864,79.178430154649959,40.176792000000013]
[184,"VSCode","Commercial HVAC","3 - 5.9 HP",49.999999999999993,4,"Commercial",4000,0.33664183851667306,1,1,1,0.55000000000000004,0.55000000000000004,5,1088.7034146264364,989.73037693312403,98.973037693312335,50.220990000000015]
[185,"VSCode","Commercial HVAC","3 - 5.9 HP",50.999999999999993,5,"Commercial",4000,0.33664183851667306,1,1,1,0.55000000000000004,0.55000000000000004,6,1088.7034146264364,969.93576939446143,118.76764523197494,60.265188000000023]
[186,"VSCode","Commercial HVAC","3 - 5.9 HP",51.999999999999993,6,"Commercial",4000,0.33664183851667306,1,1,1,0.55000000000000004,0.55000000000000004,7,1088.7034146264364,950.14116185579906,138.56225277063731,70.309386000000018]
[187,"VSCode","Commercial HVAC","6 - 50 HP",50,1,"Commercial",4000,0.24770815248632091,1,1,1,0.52,0.52,2,1167.3162139500257,1122.4194364904092,44.896777459616487,9.3327649657328848]
[188,"VSCode","Commercial HVAC","6 - 50 HP",51,2,"Commercial",4000,0.24770815248632091,1,1,1,0.52,0.52,3,1167.3162139500257,1099.9710477606009,67.345166189424845,13.999147448599327]
[189,"VSCode","Commercial HVAC","6 - 50 HP",52,3,"Commercial",4000,0.24770815248632091,1,1,1,0.52,0.52,4,1167.3162139500257,1077.5226590307927,89.793554919232974,18.66552993146577]
[190,"VSCode","Commercial HVAC","6 - 50 HP",53,4,"Commercial",4000,0.24770815248632091,1,1,1,0.52,0.52,5,1167.3162139500257,1055.0742703009846,112.2419436490411,23.331912414332212]
[191,"VSCode","Commercial HVAC","6 - 50 HP",54,5,"Commercial",4000,0.24770815248632091,1,1,1,0.52,0.52,6,1167.3162139500257,1032.6258815711765,134.69033237884923,27.998294897198654]
[192,"VSCode","Commercial HVAC","6 - 50 HP",55,6,"Commercial",4000,0.24770815248632091,1,1,1,0.52,0.52,7,1167.3162139500257,1010.1774928413681,157.13872110865759,32.6646773800651]
[193,"VSCode","Commercial HVAC","50.1 - 200 HP",50,1,"Commercial",4000,0.17506451625407168,1,1,1,0.52,0.52,2,1280.0358914188821,1230.8037417489249,49.232149669957153,2.3489437481429549]
[194,"VSCode","Commercial HVAC","50.1 - 200 HP",51,2,"Commercial",4000,0.17506451625407168,1,1,1,0.52,0.52,3,1280.0358914188821,1206.1876669139465,73.848224504935615,3.5234156222144324]
[195,"VSCode","Commercial HVAC","50.1 - 200 HP",52,3,"Commercial",4000,0.17506451625407168,1,1,1,0.52,0.52,4,1280.0358914188821,1181.571592078968,98.464299339914078,4.6978874962859098]
[196,"VSCode","Commercial HVAC","50.1 - 200 HP",53,4,"Commercial",4000,0.17506451625407168,1,1,1,0.52,0.52,5,1280.0358914188821,1156.9555172439893,123.08037417489277,5.8723593703573869]
[197,"VSCode","Commercial HVAC","50.1 - 200 HP",54,5,"Commercial",4000,0.17506451625407168,1,1,1,0.52,0.52,6,1280.0358914188821,1132.3394424090111,147.696449009871,7.0468312444288648]
[198,"VSCode","Commercial HVAC","50.1 - 200 HP",55,6,"Commercial",4000,0.17506451625407168,1,1,1,0.52,0.52,7,1280.0358914188821,1107.7233675740326,172.31252384484947,8.2213031185003427]
[199,"VSCode","Commercial DHW","1 - 1.9 HP",44.000000000000007,1,"Commercial",6000,0.39003439574594323,1,1,1,0.57999999999999996,0.57999999999999996,2,1583.5195058918714,1528.9153849990482,54.604120892823175,66.945132000000001]
[200,"VSCode","Commercial DHW","1 - 1.9 HP",45.000000000000007,2,"Commercial",6000,0.39003439574594323,1,1,1,0.57999999999999996,0.57999999999999996,3,1583.5195058918714,1501.6133245526369,81.906181339234536,100.417698]
[201,"VSCode","Commercial DHW","1 - 1.9 HP",46.000000000000007,3,"Commercial",6000,0.39003439574594323,1,1,1,0.57999999999999996,0.57999999999999996,4,1583.5195058918714,1474.3112641062253,109.20824178564612,133.890264]
[202,"VSCode","Commercial DHW","1 - 1.9 HP",47.000000000000007,4,"Commercial",6000,0.39003439574594323,1,1,1,0.57999999999999996,0.57999999999999996,5,1583.5195058918714,1447.0092036598135,136.51030223205794,167.36283]
[203,"VSCode","Commercial DHW","1 - 1.9 HP",48.000000000000007,5,"Commercial",6000,0.39003439574594323,1,1,1,0.57999999999999996,0.57999999999999996,6,1583.5195058918714,1419.7071432134019,163.81236267846953,200.835396]
[204,"VSCode","Commercial DHW","1 - 1.9 HP",49.000000000000007,6,"Commercial",6000,0.39003439574594323,1,1,1,0.57999999999999996,0.57999999999999996,7,1583.5195058918714,1392.4050827669903,191.11442312488111,234.307962]
[205,"VSCode","Commercial DHW","2 - 2.9 HP",45.000000000000007,1,"Commercial",6000,0.36520827043091608,1,1,1,0.56999999999999995,0.56999999999999995,2,1619.5568354841951,1562.7302798531705,56.826555631024576,35.97384000000001]
[206,"VSCode","Commercial DHW","2 - 2.9 HP",46.000000000000007,2,"Commercial",6000,0.36520827043091608,1,1,1,0.56999999999999995,0.56999999999999995,3,1619.5568354841951,1534.3170020376583,85.23983344653675,53.960760000000015]
[207,"VSCode","Commercial DHW","2 - 2.9 HP",47.000000000000007,3,"Commercial",6000,0.36520827043091608,1,1,1,0.56999999999999995,0.56999999999999995,4,1619.5568354841951,1505.9037242221461,113.65311126204892,71.94768000000002]
[208,"VSCode","Commercial DHW","2 - 2.9 HP",48.000000000000007,4,"Commercial",6000,0.36520827043091608,1,1,1,0.56999999999999995,0.56999999999999995,5,1619.5568354841951,1477.490446406634,142.0663890775611,89.934600000000017]
[209,"VSCode","Commercial DHW","2 - 2.9 HP",49.000000000000007,5,"Commercial",6000,0.36520827043091608,1,1,1,0.56999999999999995,0.56999999999999995,6,1619.5568354841951,1449.0771685911218,170.47966689307327,107.92152000000003]
[210,"VSCode","Commercial DHW","2 - 2.9 HP",50.000000000000007,6,"Commercial",6000,0.36520827043091608,1,1,1,0.56999999999999995,0.56999999999999995,7,1619.5568354841951,1420.6638907756096,198.89294470858545,125.90844000000004]
[211,"VSCode","Commercial DHW","3 - 5.9 HP",46.999999999999993,1,"Commercial",6000,0.33664183851667306,1,1,1,0.55000000000000004,0.55000000000000004,2,1633.0551219396543,1573.671299323667,59.383822615987356,20.088396000000007]
[212,"VSCode","Commercial DHW","3 - 5.9 HP",47.999999999999993,2,"Commercial",6000,0.33664183851667306,1,1,1,0.55000000000000004,0.55000000000000004,3,1633.0551219396543,1543.9793880156731,89.075733923981261,30.132594000000012]
[213,"VSCode","Commercial DHW","3 - 5.9 HP",48.999999999999993,3,"Commercial",6000,0.33664183851667306,1,1,1,0.55000000000000004,0.55000000000000004,4,1633.0551219396543,1514.2874767076798,118.76764523197448,40.176792000000013]
[214,"VSCode","Commercial DHW","3 - 5.9 HP",49.999999999999993,4,"Commercial",6000,0.33664183851667306,1,1,1,0.55000000000000004,0.55000000000000004,5,1633.0551219396543,1484.5955653996859,148.45955653996839,50.220990000000015]
[215,"VSCode","Commercial DHW","3 - 5.9 HP",50.999999999999993,5,"Commercial",6000,0.33664183851667306,1,1,1,0.55000000000000004,0.55000000000000004,6,1633.0551219396543,1454.903654091692,178.15146784796229,60.265188000000023]
[216,"VSCode","Commercial DHW","3 - 5.9 HP",51.999999999999993,6,"Commercial",6000,0.33664183851667306,1,1,1,0.55000000000000004,0.55000000000000004,7,1633.0551219396543,1425.2117427836986,207.84337915595574,70.309386000000018]
[217,"VSCode","Commercial DHW","6 - 50 HP",50,1,"Commercial",6000,0.24770815248632091,1,1,1,0.52,0.52,2,1750.9743209250387,1683.6291547356138,67.345166189424845,9.3327649657328848]
[218,"VSCode","Commercial DHW","6 - 50 HP",51,2,"Commercial",6000,0.24770815248632091,1,1,1,0.52,0.52,3,1750.9743209250387,1649.9565716409013,101.01774928413738,13.999147448599327]
[219,"VSCode","Commercial DHW","6 - 50 HP",52,3,"Commercial",6000,0.24770815248632091,1,1,1,0.52,0.52,4,1750.9743209250387,1616.2839885461892,134.69033237884946,18.66552993146577]
[220,"VSCode","Commercial DHW","6 - 50 HP",53,4,"Commercial",6000,0.24770815248632091,1,1,1,0.52,0.52,5,1750.9743209250387,1582.6114054514769,168.36291547356177,23.331912414332212]
[221,"VSCode","Commercial DHW","6 - 50 HP",54,5,"Commercial",6000,0.24770815248632091,1,1,1,0.52,0.52,6,1750.9743209250387,1548.9388223567648,202.03549856827385,27.998294897198654]
[222,"VSCode","Commercial DHW","6 - 50 HP",55,6,"Commercial",6000,0.24770815248632091,1,1,1,0.52,0.52,7,1750.9743209250387,1515.2662392620523,235.70808166298639,32.6646773800651]
[223,"VSCode","Commercial DHW","50.1 - 200 HP",50,1,"Commercial",6000,0.17506451625407168,1,1,1,0.52,0.52,2,1920.053837128323,1846.2056126233877,73.848224504935388,2.3489437481429549]
[224,"VSCode","Commercial DHW","50.1 - 200 HP",51,2,"Commercial",6000,0.17506451625407168,1,1,1,0.52,0.52,3,1920.053837128323,1809.28150037092,110.77233675740308,3.5234156222144324]
[225,"VSCode","Commercial DHW","50.1 - 200 HP",52,3,"Commercial",6000,0.17506451625407168,1,1,1,0.52,0.52,4,1920.053837128323,1772.3573881184518,147.69644900987123,4.6978874962859098]
[226,"VSCode","Commercial DHW","50.1 - 200 HP",53,4,"Commercial",6000,0.17506451625407168,1,1,1,0.52,0.52,5,1920.053837128323,1735.4332758659841,184.62056126233892,5.8723593703573869]
[227,"VSCode","Commercial DHW","50.1 - 200 HP",54,5,"Commercial",6000,0.17506451625407168,1,1,1,0.52,0.52,6,1920.053837128323,1698.5091636135164,221.54467351480662,7.0468312444288648]
[228,"VSCode","Commercial DHW","50.1 - 200 HP",55,6,"Commercial",6000,0.17506451625407168,1,1,1,0.52,0.52,7,1920.053837128323,1661.5850513610487,258.46878576727431,8.2213031185003427]
[229,"VSCode","Municipal","1 - 1.9 HP",44.000000000000007,1,"Municipal",3400,0.39003439574594323,0.99,0.99,0.99,0.57999999999999996,0.57999999999999996,2,888.35444280534,857.7215309844662,30.632911820873801,66.945132000000001]
[230,"VSCode","Municipal","1 - 1.9 HP",45.000000000000007,2,"Municipal",3400,0.39003439574594323,0.99,0.99,0.99,0.57999999999999996,0.57999999999999996,3,888.35444280534,842.40507507402924,45.949367731310758,100.417698]
[231,"VSCode","Municipal","1 - 1.9 HP",46.000000000000007,3,"Municipal",3400,0.39003439574594323,0.99,0.99,0.99,0.57999999999999996,0.57999999999999996,4,888.35444280534,827.0886191635924,61.265823641747602,133.890264]
[232,"VSCode","Municipal","1 - 1.9 HP",47.000000000000007,4,"Municipal",3400,0.39003439574594323,0.99,0.99,0.99,0.57999999999999996,0.57999999999999996,5,888.35444280534,811.77216325315544,76.582279552184559,167.36283]
[233,"VSCode","Municipal","1 - 1.9 HP",48.000000000000007,5,"Municipal",3400,0.39003439574594323,0.99,0.99,0.99,0.57999999999999996,0.57999999999999996,6,888.35444280534,796.45570734271848,91.898735462621516,200.835396]
[234,"VSCode","Municipal","1 - 1.9 HP",49.000000000000007,6,"Municipal",3400,0.39003439574594323,0.99,0.99,0.99,0.57999999999999996,0.57999999999999996,7,888.35444280534,781.13925143228164,107.21519137305836,234.307962]
[235,"VSCode","Municipal","2 - 2.9 HP",45.000000000000007,1,"Municipal",3400,0.36520827043091608,0.99,0.99,0.99,0.56999999999999995,0.56999999999999995,2,908.57138470663324,876.69168699762872,31.879697709004517,35.97384000000001]
[236,"VSCode","Municipal","2 - 2.9 HP",46.000000000000007,2,"Municipal",3400,0.36520827043091608,0.99,0.99,0.99,0.56999999999999995,0.56999999999999995,3,908.57138470663324,860.75183814312641,47.819546563506833,53.960760000000015]
[237,"VSCode","Municipal","2 - 2.9 HP",47.000000000000007,3,"Municipal",3400,0.36520827043091608,0.99,0.99,0.99,0.56999999999999995,0.56999999999999995,4,908.57138470663324,844.81198928862398,63.759395418009262,71.94768000000002]
[238,"VSCode","Municipal","2 - 2.9 HP",48.000000000000007,4,"Municipal",3400,0.36520827043091608,0.99,0.99,0.99,0.56999999999999995,0.56999999999999995,5,908.57138470663324,828.87214043412166,79.699244272511578,89.934600000000017]
[239,"VSCode","Municipal","2 - 2.9 HP",49.000000000000007,5,"Municipal",3400,0.36520827043091608,0.99,0.99,0.99,0.56999999999999995,0.56999999999999995,6,908.57138470663324,812.93229157961923,95.639093127014007,107.92152000000003]
[240,"VSCode","Municipal","2 - 2.9 HP",50.000000000000007,6,"Municipal",3400,0.36520827043091608,0.99,0.99,0.99,0.56999999999999995,0.56999999999999995,7,908.57138470663324,796.99244272511692,111.57894198151632,125.90844000000004]
[241,"VSCode","Municipal","3 - 5.9 HP",46.999999999999993,1,"Municipal",3400,0.33664183851667306,0.99,0.99,0.99,0.55000000000000004,0.55000000000000004,2,916.14392340814595,882.82959892057704,33.314324487568911,20.088396000000007]
[242,"VSCode","Municipal","3 - 5.9 HP",47.999999999999993,2,"Municipal",3400,0.33664183851667306,0.99,0.99,0.99,0.55000000000000004,0.55000000000000004,3,916.14392340814595,866.17243667679259,49.971486731353366,30.132594000000012]
[243,"VSCode","Municipal","3 - 5.9 HP",48.999999999999993,3,"Municipal",3400,0.33664183851667306,0.99,0.99,0.99,0.55000000000000004,0.55000000000000004,4,916.14392340814595,849.51527443300836,66.628648975137594,40.176792000000013]
[244,"VSCode","Municipal","3 - 5.9 HP",49.999999999999993,4,"Municipal",3400,0.33664183851667306,0.99,0.99,0.99,0.55000000000000004,0.55000000000000004,5,916.14392340814595,832.8581121892239,83.285811218922049,50.220990000000015]
[245,"VSCode","Municipal","3 - 5.9 HP",50.999999999999993,5,"Municipal",3400,0.33664183851667306,0.99,0.99,0.99,0.55000000000000004,0.55000000000000004,6,916.14392340814595,816.20094994543933,99.942973462706618,60.265188000000023]
[246,"VSCode","Municipal","3 - 5.9 HP",51.999999999999993,6,"Municipal",3400,0.33664183851667306,0.99,0.99,0.99,0.55000000000000004,0.55000000000000004,7,916.14392340814595,799.54378770165488,116.60013570649107,70.309386000000018]
[247,"VSCode","Municipal","6 - 50 HP",50,1,"Municipal",3400,0.24770815248632091,0.99,0.99,0.99,0.52,0.52,2,982.29659403894641,944.51595580667947,37.780638232266938,9.3327649657328848]
[248,"VSCode","Municipal","6 - 50 HP",51,2,"Municipal",3400,0.24770815248632091,0.99,0.99,0.99,0.52,0.52,3,982.29659403894641,925.62563669054566,56.670957348400748,13.999147448599327]
[249,"VSCode","Municipal","6 - 50 HP",52,3,"Municipal",3400,0.24770815248632091,0.99,0.99,0.99,0.52,0.52,4,982.29659403894641,906.73531757441208,75.56127646453433,18.66552993146577]
[250,"VSCode","Municipal","6 - 50 HP",53,4,"Municipal",3400,0.24770815248632091,0.99,0.99,0.99,0.52,0.52,5,982.29659403894641,887.84499845827861,94.451595580667799,23.331912414332212]
[251,"VSCode","Municipal","6 - 50 HP",54,5,"Municipal",3400,0.24770815248632091,0.99,0.99,0.99,0.52,0.52,6,982.29659403894641,868.95467934214491,113.3419146968015,27.998294897198654]
[252,"VSCode","Municipal","6 - 50 HP",55,6,"Municipal",3400,0.24770815248632091,0.99,0.99,0.99,0.52,0.52,7,982.29659403894641,850.06436022601133,132.23223381293508,32.6646773800651]
[253,"VSCode","Municipal","50.1 - 200 HP",50,1,"Municipal",3400,0.17506451625407168,0.99,0.99,0.99,0.52,0.52,2,1077.1502026289893,1035.7213486817204,41.428853947268863,2.3489437481429549]
[254,"VSCode","Municipal","50.1 - 200 HP",51,2,"Municipal",3400,0.17506451625407168,0.99,0.99,0.99,0.52,0.52,3,1077.1502026289893,1015.006921708086,62.143280920903294,3.5234156222144324]
[255,"VSCode","Municipal","50.1 - 200 HP",52,3,"Municipal",3400,0.17506451625407168,0.99,0.99,0.99,0.52,0.52,4,1077.1502026289893,994.29249473445145,82.857707894537839,4.6978874962859098]
[256,"VSCode","Municipal","50.1 - 200 HP",53,4,"Municipal",3400,0.17506451625407168,0.99,0.99,0.99,0.52,0.52,5,1077.1502026289893,973.57806776081702,103.57213486817227,5.8723593703573869]
[257,"VSCode","Municipal","50.1 - 200 HP",54,5,"Municipal",3400,0.17506451625407168,0.99,0.99,0.99,0.52,0.52,6,1077.1502026289893,952.86364078718282,124.28656184180647,7.0468312444288648]
[258,"VSCode","Municipal","50.1 - 200 HP",55,6,"Municipal",3400,0.17506451625407168,0.99,0.99,0.99,0.52,0.52,7,1077.1502026289893,932.14921381354839,145.00098881544091,8.2213031185003427]
[259,"VSCode","Industrial BFW","1 - 1.9 HP",44.000000000000007,1,"Industrial",4000,0.39003439574594323,1.214,1.214,1.214,0.57999999999999996,0.57999999999999996,2,1281.5951201018215,1237.4021849258963,44.192935175925186,66.945132000000001]
[260,"VSCode","Industrial BFW","1 - 1.9 HP",45.000000000000007,2,"Industrial",4000,0.39003439574594323,1.214,1.214,1.214,0.57999999999999996,0.57999999999999996,3,1281.5951201018215,1215.3057173379339,66.289402763887665,100.417698]
[261,"VSCode","Industrial BFW","1 - 1.9 HP",46.000000000000007,3,"Industrial",4000,0.39003439574594323,1.214,1.214,1.214,0.57999999999999996,0.57999999999999996,4,1281.5951201018215,1193.2092497499716,88.385870351849917,133.890264]
[262,"VSCode","Industrial BFW","1 - 1.9 HP",47.000000000000007,4,"Industrial",4000,0.39003439574594323,1.214,1.214,1.214,0.57999999999999996,0.57999999999999996,5,1281.5951201018215,1171.1127821620091,110.4823379398124,167.36283]
[263,"VSCode","Industrial BFW","1 - 1.9 HP",48.000000000000007,5,"Industrial",4000,0.39003439574594323,1.214,1.214,1.214,0.57999999999999996,0.57999999999999996,6,1281.5951201018215,1149.0163145740466,132.57880552777488,200.835396]
[264,"VSCode","Industrial BFW","1 - 1.9 HP",49.000000000000007,6,"Industrial",4000,0.39003439574594323,1.214,1.214,1.214,0.57999999999999996,0.57999999999999996,7,1281.5951201018215,1126.9198469860842,154.67527311573735,234.307962]
[265,"VSCode","Industrial BFW","2 - 2.9 HP",45.000000000000007,1,"Industrial",4000,0.36520827043091608,1.214,1.214,1.214,0.56999999999999995,0.56999999999999995,2,1310.7613321852086,1264.7697064944991,45.991625690709498,35.97384000000001]
[266,"VSCode","Industrial BFW","2 - 2.9 HP",46.000000000000007,2,"Industrial",4000,0.36520827043091608,1.214,1.214,1.214,0.56999999999999995,0.56999999999999995,3,1310.7613321852086,1241.7738936491446,68.987438536064019,53.960760000000015]
[267,"VSCode","Industrial BFW","2 - 2.9 HP",47.000000000000007,3,"Industrial",4000,0.36520827043091608,1.214,1.214,1.214,0.56999999999999995,0.56999999999999995,4,1310.7613321852086,1218.7780808037903,91.983251381418313,71.94768000000002]
[268,"VSCode","Industrial BFW","2 - 2.9 HP",48.000000000000007,4,"Industrial",4000,0.36520827043091608,1.214,1.214,1.214,0.56999999999999995,0.56999999999999995,5,1310.7613321852086,1195.7822679584356,114.97906422677306,89.934600000000017]
[269,"VSCode","Industrial BFW","2 - 2.9 HP",49.000000000000007,5,"Industrial",4000,0.36520827043091608,1.214,1.214,1.214,0.56999999999999995,0.56999999999999995,6,1310.7613321852086,1172.786455113081,137.97487707212758,107.92152000000003]
[270,"VSCode","Industrial BFW","2 - 2.9 HP",50.000000000000007,6,"Industrial",4000,0.36520827043091608,1.214,1.214,1.214,0.56999999999999995,0.56999999999999995,7,1310.7613321852086,1149.7906422677268,160.97068991748188,125.90844000000004]
[271,"VSCode","Industrial BFW","3 - 5.9 HP",46.999999999999993,1,"Industrial",4000,0.33664183851667306,1.214,1.214,1.214,0.55000000000000004,0.55000000000000004,2,1321.6859453564937,1273.624638252621,48.06130710387265,20.088396000000007]
[272,"VSCode","Industrial BFW","3 - 5.9 HP",47.999999999999993,2,"Industrial",4000,0.33664183851667306,1.214,1.214,1.214,0.55000000000000004,0.55000000000000004,3,1321.6859453564937,1249.5939847006848,72.091960655808862,30.132594000000012]
[273,"VSCode","Industrial BFW","3 - 5.9 HP",48.999999999999993,3,"Industrial",4000,0.33664183851667306,1.214,1.214,1.214,0.55000000000000004,0.55000000000000004,4,1321.6859453564937,1225.5633311487486,96.122614207745073,40.176792000000013]
[274,"VSCode","Industrial BFW","3 - 5.9 HP",49.999999999999993,4,"Industrial",4000,0.33664183851667306,1.214,1.214,1.214,0.55000000000000004,0.55000000000000004,5,1321.6859453564937,1201.5326775968126,120.15326775968106,50.220990000000015]
[275,"VSCode","Industrial BFW","3 - 5.9 HP",50.999999999999993,5,"Industrial",4000,0.33664183851667306,1.214,1.214,1.214,0.55000000000000004,0.55000000000000004,6,1321.6859453564937,1177.5020240448762,144.1839213116175,60.265188000000023]
[276,"VSCode","Industrial BFW","3 - 5.9 HP",51.999999999999993,6,"Industrial",4000,0.33664183851667306,1.214,1.214,1.214,0.55000000000000004,0.55000000000000004,7,1321.6859453564937,1153.47137049294,168.21457486355371,70.309386000000018]
[277,"VSCode","Industrial BFW","6 - 50 HP",50,1,"Industrial",4000,0.24770815248632091,1.214,1.214,1.214,0.52,0.52,2,1417.121883735331,1362.6171958993568,54.50468783597421,9.3327649657328848]
[278,"VSCode","Industrial BFW","6 - 50 HP",51,2,"Industrial",4000,0.24770815248632091,1.214,1.214,1.214,0.52,0.52,3,1417.121883735331,1335.3648519813694,81.757031753961655,13.999147448599327]
[279,"VSCode","Industrial BFW","6 - 50 HP",52,3,"Industrial",4000,0.24770815248632091,1.214,1.214,1.214,0.52,0.52,4,1417.121883735331,1308.1125080633824,109.00937567194865,18.66552993146577]
[280,"VSCode","Industrial BFW","6 - 50 HP",53,4,"Industrial",4000,0.24770815248632091,1.214,1.214,1.214,0.52,0.52,5,1417.121883735331,1280.8601641453952,136.26171958993586,23.331912414332212]
[281,"VSCode","Industrial BFW","6 - 50 HP",54,5,"Industrial",4000,0.24770815248632091,1.214,1.214,1.214,0.52,0.52,6,1417.121883735331,1253.6078202274082,163.51406350792286,27.998294897198654]
[282,"VSCode","Industrial BFW","6 - 50 HP",55,6,"Industrial",4000,0.24770815248632091,1.214,1.214,1.214,0.52,0.52,7,1417.121883735331,1226.355476309421,190.76640742591007,32.6646773800651]
[283,"VSCode","Industrial BFW","50.1 - 200 HP",50,1,"Industrial",4000,0.17506451625407168,1.214,1.214,1.214,0.52,0.52,2,1553.9635721825227,1494.1957424831949,59.767829699327876,2.3489437481429549]
[284,"VSCode","Industrial BFW","50.1 - 200 HP",51,2,"Industrial",4000,0.17506451625407168,1.214,1.214,1.214,0.52,0.52,3,1553.9635721825227,1464.311827633531,89.651744548991701,3.5234156222144324]
[285,"VSCode","Industrial BFW","50.1 - 200 HP",52,3,"Industrial",4000,0.17506451625407168,1.214,1.214,1.214,0.52,0.52,4,1553.9635721825227,1434.4279127838672,119.53565939865553,4.6978874962859098]
[286,"VSCode","Industrial BFW","50.1 - 200 HP",53,4,"Industrial",4000,0.17506451625407168,1.214,1.214,1.214,0.52,0.52,5,1553.9635721825227,1404.5439979342029,149.4195742483198,5.8723593703573869]
[287,"VSCode","Industrial BFW","50.1 - 200 HP",54,5,"Industrial",4000,0.17506451625407168,1.214,1.214,1.214,0.52,0.52,6,1553.9635721825227,1374.6600830845393,179.3034890979834,7.0468312444288648]
[288,"VSCode","Industrial BFW","50.1 - 200 HP",55,6,"Industrial",4000,0.17506451625407168,1.214,1.214,1.214,0.52,0.52,7,1553.9635721825227,1344.7761682348755,209.18740394764723,8.2213031185003427]
[289,"VSCode","Industrial General","1 - 1.9 HP",44.000000000000007,1,"Industrial",6800,0.39003439574594323,1.214,1.214,1.214,0.57999999999999996,0.57999999999999996,2,2178.7117041730962,2103.5837143740241,75.127989799072111,66.945132000000001]
[290,"VSCode","Industrial General","1 - 1.9 HP",45.000000000000007,2,"Industrial",6800,0.39003439574594323,1.214,1.214,1.214,0.57999999999999996,0.57999999999999996,3,2178.7117041730962,2066.0197194744878,112.69198469860839,100.417698]
[291,"VSCode","Industrial General","1 - 1.9 HP",46.000000000000007,3,"Industrial",6800,0.39003439574594323,1.214,1.214,1.214,0.57999999999999996,0.57999999999999996,4,2178.7117041730962,2028.4557245749518,150.25597959814445,133.890264]
[292,"VSCode","Industrial General","1 - 1.9 HP",47.000000000000007,4,"Industrial",6800,0.39003439574594323,1.214,1.214,1.214,0.57999999999999996,0.57999999999999996,5,2178.7117041730962,1990.8917296754155,187.81997449768073,167.36283]
[293,"VSCode","Industrial General","1 - 1.9 HP",48.000000000000007,5,"Industrial",6800,0.39003439574594323,1.214,1.214,1.214,0.57999999999999996,0.57999999999999996,6,2178.7117041730962,1953.3277347758792,225.38396939721702,200.835396]
[294,"VSCode","Industrial General","1 - 1.9 HP",49.000000000000007,6,"Industrial",6800,0.39003439574594323,1.214,1.214,1.214,0.57999999999999996,0.57999999999999996,7,2178.7117041730962,1915.7637398763432,262.94796429675307,234.307962]
[295,"VSCode","Industrial General","2 - 2.9 HP",45.000000000000007,1,"Industrial",6800,0.36520827043091608,1.214,1.214,1.214,0.56999999999999995,0.56999999999999995,2,2228.2942647148543,2150.1085010406491,78.185763674205191,35.97384000000001]
[296,"VSCode","Industrial General","2 - 2.9 HP",46.000000000000007,2,"Industrial",6800,0.36520827043091608,1.214,1.214,1.214,0.56999999999999995,0.56999999999999995,3,2228.2942647148543,2111.0156192035465,117.27864551130779,53.960760000000015]
[297,"VSCode","Industrial General","2 - 2.9 HP",47.000000000000007,3,"Industrial",6800,0.36520827043091608,1.214,1.214,1.214,0.56999999999999995,0.56999999999999995,4,2228.2942647148543,2071.9227373664435,156.37152734841084,71.94768000000002]
[298,"VSCode","Industrial General","2 - 2.9 HP",48.000000000000007,4,"Industrial",6800,0.36520827043091608,1.214,1.214,1.214,0.56999999999999995,0.56999999999999995,5,2228.2942647148543,2032.8298555293409,195.46440918551343,89.934600000000017]
[299,"VSCode","Industrial General","2 - 2.9 HP",49.000000000000007,5,"Industrial",6800,0.36520827043091608,1.214,1.214,1.214,0.56999999999999995,0.56999999999999995,6,2228.2942647148543,1993.7369736922378,234.55729102261648,107.92152000000003]
[300,"VSCode","Industrial General","2 - 2.9 HP",50.000000000000007,6,"Industrial",6800,0.36520827043091608,1.214,1.214,1.214,0.56999999999999995,0.56999999999999995,7,2228.2942647148543,1954.6440918551352,273.65017285971908,125.90844000000004]
[301,"VSCode","Industrial General","3 - 5.9 HP",46.999999999999993,1,"Industrial",6800,0.33664183851667306,1.214,1.214,1.214,0.55000000000000004,0.55000000000000004,2,2246.8661071060392,2165.1618850294558,81.704222076583392,20.088396000000007]
[302,"VSCode","Industrial General","3 - 5.9 HP",47.999999999999993,2,"Industrial",6800,0.33664183851667306,1.214,1.214,1.214,0.55000000000000004,0.55000000000000004,3,2246.8661071060392,2124.3097739911641,122.55633311487509,30.132594000000012]
[303,"VSCode","Industrial General","3 - 5.9 HP",48.999999999999993,3,"Industrial",6800,0.33664183851667306,1.214,1.214,1.214,0.55000000000000004,0.55000000000000004,4,2246.8661071060392,2083.4576629528729,163.40844415316633,40.176792000000013]
[304,"VSCode","Industrial General","3 - 5.9 HP",49.999999999999993,4,"Industrial",6800,0.33664183851667306,1.214,1.214,1.214,0.55000000000000004,0.55000000000000004,5,2246.8661071060392,2042.6055519145814,204.2605551914578,50.220990000000015]
[305,"VSCode","Industrial General","3 - 5.9 HP",50.999999999999993,5,"Industrial",6800,0.33664183851667306,1.214,1.214,1.214,0.55000000000000004,0.55000000000000004,6,2246.8661071060392,2001.7534408762897,245.11266622974949,60.265188000000023]
[306,"VSCode","Industrial General","3 - 5.9 HP",51.999999999999993,6,"Industrial",6800,0.33664183851667306,1.214,1.214,1.214,0.55000000000000004,0.55000000000000004,7,2246.8661071060392,1960.9013298379978,285.96477726804142,70.309386000000018]
[307,"VSCode","Industrial General","6 - 50 HP",50,1,"Industrial",6800,0.24770815248632091,1.214,1.214,1.214,0.52,0.52,2,2409.1072023500628,2316.4492330289067,92.657969321156088,9.3327649657328848]
[308,"VSCode","Industrial General","6 - 50 HP",51,2,"Industrial",6800,0.24770815248632091,1.214,1.214,1.214,0.52,0.52,3,2409.1072023500628,2270.1202483683282,138.98695398173459,13.999147448599327]
[309,"VSCode","Industrial General","6 - 50 HP",52,3,"Industrial",6800,0.24770815248632091,1.214,1.214,1.214,0.52,0.52,4,2409.1072023500628,2223.7912637077497,185.31593864231309,18.66552993146577]
[310,"VSCode","Industrial General","6 - 50 HP",53,4,"Industrial",6800,0.24770815248632091,1.214,1.214,1.214,0.52,0.52,5,2409.1072023500628,2177.4622790471722,231.64492330289067,23.331912414332212]
[311,"VSCode","Industrial General","6 - 50 HP",54,5,"Industrial",6800,0.24770815248632091,1.214,1.214,1.214,0.52,0.52,6,2409.1072023500628,2131.1332943865937,277.97390796346917,27.998294897198654]
[312,"VSCode","Industrial General","6 - 50 HP",55,6,"Industrial",6800,0.24770815248632091,1.214,1.214,1.214,0.52,0.52,7,2409.1072023500628,2084.8043097260156,324.30289262404722,32.6646773800651]
[313,"VSCode","Industrial General","50.1 - 200 HP",50,1,"Industrial",6800,0.17506451625407168,1.214,1.214,1.214,0.52,0.52,2,2641.7380727102886,2540.1327622214312,101.60531048885741,2.3489437481429549]
[314,"VSCode","Industrial General","50.1 - 200 HP",51,2,"Industrial",6800,0.17506451625407168,1.214,1.214,1.214,0.52,0.52,3,2641.7380727102886,2489.3301069770027,152.40796573328589,3.5234156222144324]
[315,"VSCode","Industrial General","50.1 - 200 HP",52,3,"Industrial",6800,0.17506451625407168,1.214,1.214,1.214,0.52,0.52,4,2641.7380727102886,2438.5274517325738,203.21062097771483,4.6978874962859098]
[316,"VSCode","Industrial General","50.1 - 200 HP",53,4,"Industrial",6800,0.17506451625407168,1.214,1.214,1.214,0.52,0.52,5,2641.7380727102886,2387.7247964881453,254.0132762221433,5.8723593703573869]
[317,"VSCode","Industrial General","50.1 - 200 HP",54,5,"Industrial",6800,0.17506451625407168,1.214,1.214,1.214,0.52,0.52,6,2641.7380727102886,2336.9221412437169,304.81593146657178,7.0468312444288648]
[318,"VSCode","Industrial General","50.1 - 200 HP",55,6,"Industrial",6800,0.17506451625407168,1.214,1.214,1.214,0.52,0.52,7,2641.7380727102886,2286.1194859992884,355.61858671100026,8.2213031185003427]
[319,"VSCode","Agricultural","1 - 1.9 HP",44.000000000000007,1,"Agricultural",2400,0.39003439574594323,1.845,1.845,1.845,0.57999999999999996,0.57999999999999996,2,1168.6373953482012,1128.3395541292975,40.297841218903613,66.945132000000001]
[320,"VSCode","Agricultural","1 - 1.9 HP",45.000000000000007,2,"Agricultural",2400,0.39003439574594323,1.845,1.845,1.845,0.57999999999999996,0.57999999999999996,3,1168.6373953482012,1108.190633519846,60.446761828355193,100.417698]
[321,"VSCode","Agricultural","1 - 1.9 HP",46.000000000000007,3,"Agricultural",2400,0.39003439574594323,1.845,1.845,1.845,0.57999999999999996,0.57999999999999996,4,1168.6373953482012,1088.0417129103942,80.595682437807,133.890264]
[322,"VSCode","Agricultural","1 - 1.9 HP",47.000000000000007,4,"Agricultural",2400,0.39003439574594323,1.845,1.845,1.845,0.57999999999999996,0.57999999999999996,5,1168.6373953482012,1067.8927923009426,100.74460304725858,167.36283]
[323,"VSCode","Agricultural","1 - 1.9 HP",48.000000000000007,5,"Agricultural",2400,0.39003439574594323,1.845,1.845,1.845,0.57999999999999996,0.57999999999999996,6,1168.6373953482012,1047.7438716914908,120.89352365671039,200.835396]
[324,"VSCode","Agricultural","1 - 1.9 HP",49.000000000000007,6,"Agricultural",2400,0.39003439574594323,1.845,1.845,1.845,0.57999999999999996,0.57999999999999996,7,1168.6373953482012,1027.594951082039,141.04244426616219,234.307962]
[325,"VSCode","Agricultural","2 - 2.9 HP",45.000000000000007,1,"Agricultural",2400,0.36520827043091608,1.845,1.845,1.845,0.56999999999999995,0.56999999999999995,2,1195.2329445873361,1153.2949465316397,41.937998055696426,35.97384000000001]
[326,"VSCode","Agricultural","2 - 2.9 HP",46.000000000000007,2,"Agricultural",2400,0.36520827043091608,1.845,1.845,1.845,0.56999999999999995,0.56999999999999995,3,1195.2329445873361,1132.3259475037919,62.906997083544184,53.960760000000015]
[327,"VSCode","Agricultural","2 - 2.9 HP",47.000000000000007,3,"Agricultural",2400,0.36520827043091608,1.845,1.845,1.845,0.56999999999999995,0.56999999999999995,4,1195.2329445873361,1111.3569484759439,83.875996111392169,71.94768000000002]
[328,"VSCode","Agricultural","2 - 2.9 HP",48.000000000000007,4,"Agricultural",2400,0.36520827043091608,1.845,1.845,1.845,0.56999999999999995,0.56999999999999995,5,1195.2329445873361,1090.3879494480957,104.84499513924038,89.934600000000017]
[329,"VSCode","Agricultural","2 - 2.9 HP",49.000000000000007,5,"Agricultural",2400,0.36520827043091608,1.845,1.845,1.845,0.56999999999999995,0.56999999999999995,6,1195.2329445873361,1069.4189504202479,125.81399416708814,107.92152000000003]
[330,"VSCode","Agricultural","2 - 2.9 HP",50.000000000000007,6,"Agricultural",2400,0.36520827043091608,1.845,1.845,1.845,0.56999999999999995,0.56999999999999995,7,1195.2329445873361,1048.4499513924,146.78299319493613,125.90844000000004]
[331,"VSCode","Agricultural","3 - 5.9 HP",46.999999999999993,1,"Agricultural",2400,0.33664183851667306,1.845,1.845,1.845,0.55000000000000004,0.55000000000000004,2,1205.1946799914649,1161.3694189008661,43.825261090598815,20.088396000000007]
[332,"VSCode","Agricultural","3 - 5.9 HP",47.999999999999993,2,"Agricultural",2400,0.33664183851667306,1.845,1.845,1.845,0.55000000000000004,0.55000000000000004,3,1205.1946799914649,1139.4567883555667,65.737891635898222,30.132594000000012]
[333,"VSCode","Agricultural","3 - 5.9 HP",48.999999999999993,3,"Agricultural",2400,0.33664183851667306,1.845,1.845,1.845,0.55000000000000004,0.55000000000000004,4,1205.1946799914649,1117.5441578102675,87.650522181197402,40.176792000000013]
[334,"VSCode","Agricultural","3 - 5.9 HP",49.999999999999993,4,"Agricultural",2400,0.33664183851667306,1.845,1.845,1.845,0.55000000000000004,0.55000000000000004,5,1205.1946799914649,1095.6315272649681,109.56315272649681,50.220990000000015]
[335,"VSCode","Agricultural","3 - 5.9 HP",50.999999999999993,5,"Agricultural",2400,0.33664183851667306,1.845,1.845,1.845,0.55000000000000004,0.55000000000000004,6,1205.1946799914649,1073.7188967196687,131.47578327179622,60.265188000000023]
[336,"VSCode","Agricultural","3 - 5.9 HP",51.999999999999993,6,"Agricultural",2400,0.33664183851667306,1.845,1.845,1.845,0.55000000000000004,0.55000000000000004,7,1205.1946799914649,1051.8062661743695,153.3884138170954,70.309386000000018]
[337,"VSCode","Agricultural","6 - 50 HP",50,1,"Agricultural",2400,0.24770815248632091,1.845,1.845,1.845,0.52,0.52,2,1292.2190488426784,1242.5183161948828,49.700732647795576,9.3327649657328848]
[338,"VSCode","Agricultural","6 - 50 HP",51,2,"Agricultural",2400,0.24770815248632091,1.845,1.845,1.845,0.52,0.52,3,1292.2190488426784,1217.6679498709852,74.551098971693136,13.999147448599327]
[339,"VSCode","Agricultural","6 - 50 HP",52,3,"Agricultural",2400,0.24770815248632091,1.845,1.845,1.845,0.52,0.52,4,1292.2190488426784,1192.8175835470877,99.401465295590697,18.66552993146577]
[340,"VSCode","Agricultural","6 - 50 HP",53,4,"Agricultural",2400,0.24770815248632091,1.845,1.845,1.845,0.52,0.52,5,1292.2190488426784,1167.9672172231899,124.25183161948848,23.331912414332212]
[341,"VSCode","Agricultural","6 - 50 HP",54,5,"Agricultural",2400,0.24770815248632091,1.845,1.845,1.845,0.52,0.52,6,1292.2190488426784,1143.1168508992923,149.10219794338605,27.998294897198654]
[342,"VSCode","Agricultural","6 - 50 HP",55,6,"Agricultural",2400,0.24770815248632091,1.845,1.845,1.845,0.52,0.52,7,1292.2190488426784,1118.2664845753948,173.95256426728361,32.6646773800651]
[343,"VSCode","Agricultural","50.1 - 200 HP",50,1,"Agricultural",2400,0.17506451625407168,1.845,1.845,1.845,0.52,0.52,2,1416.9997318007024,1362.4997421160599,54.499989684642514,2.3489437481429549]
[344,"VSCode","Agricultural","50.1 - 200 HP",51,2,"Agricultural",2400,0.17506451625407168,1.845,1.845,1.845,0.52,0.52,3,1416.9997318007024,1335.2497472737386,81.749984526963772,3.5234156222144324]
[345,"VSCode","Agricultural","50.1 - 200 HP",52,3,"Agricultural",2400,0.17506451625407168,1.845,1.845,1.845,0.52,0.52,4,1416.9997318007024,1307.9997524314176,108.9999793692848,4.6978874962859098]
[346,"VSCode","Agricultural","50.1 - 200 HP",53,4,"Agricultural",2400,0.17506451625407168,1.845,1.845,1.845,0.52,0.52,5,1416.9997318007024,1280.7497575890964,136.24997421160606,5.8723593703573869]
[347,"VSCode","Agricultural","50.1 - 200 HP",54,5,"Agricultural",2400,0.17506451625407168,1.845,1.845,1.845,0.52,0.52,6,1416.9997318007024,1253.4997627467751,163.49996905392732,7.0468312444288648]
[348,"VSCode","Agricultural","50.1 - 200 HP",55,6,"Agricultural",2400,0.17506451625407168,1.845,1.845,1.845,0.52,0.52,7,1416.9997318007024,1226.2497679044541,190.74996389624835,8.2213031185003427]
[349,"VSNoCode","Commercial HVAC","1 - 1.9 HP",44.000000000000007,1,"Commercial",4000,0.39003439574594323,1.25,1,1,0.96,0.57999999999999996,2,2088.2435966778671,1019.2769233326987,1068.9666733451684,1046.5813341018306]
[350,"VSNoCode","Commercial HVAC","1 - 1.9 HP",45.000000000000007,2,"Commercial",4000,0.39003439574594323,1.25,1,1,0.96,0.57999999999999996,3,2088.2435966778671,1001.0755497017577,1087.1680469761095,1080.0539001018308]
[351,"VSNoCode","Commercial HVAC","1 - 1.9 HP",46.000000000000007,3,"Commercial",4000,0.39003439574594323,1.25,1,1,0.96,0.57999999999999996,4,2088.2435966778671,982.87417607081682,1105.3694206070504,1113.5264661018307]
[352,"VSNoCode","Commercial HVAC","1 - 1.9 HP",47.000000000000007,4,"Commercial",4000,0.39003439574594323,1.25,1,1,0.96,0.57999999999999996,5,2088.2435966778671,964.67280243987568,1123.5707942379913,1146.9990321018306]
[353,"VSNoCode","Commercial HVAC","1 - 1.9 HP",48.000000000000007,5,"Commercial",4000,0.39003439574594323,1.25,1,1,0.96,0.57999999999999996,6,2088.2435966778671,946.47142880893466,1141.7721678689325,1180.4715981018308]
[354,"VSNoCode","Commercial HVAC","1 - 1.9 HP",49.000000000000007,6,"Commercial",4000,0.39003439574594323,1.25,1,1,0.96,0.57999999999999996,7,2088.2435966778671,928.27005517799353,1159.9735414998736,1213.9441641018307]
[355,"VSNoCode","Commercial HVAC","2 - 2.9 HP",45.000000000000007,1,"Commercial",4000,0.36520827043091608,1.25,1,1,0.96,0.56999999999999995,2,2171.6268234395975,1041.8201865687802,1129.8066368708173,542.13012025981948]
[356,"VSNoCode","Commercial HVAC","2 - 2.9 HP",46.000000000000007,2,"Commercial",4000,0.36520827043091608,1.25,1,1,0.96,0.56999999999999995,3,2171.6268234395975,1022.8780013584388,1148.7488220811588,560.11704025981953]
[357,"VSNoCode","Commercial HVAC","2 - 2.9 HP",47.000000000000007,3,"Commercial",4000,0.36520827043091608,1.25,1,1,0.96,0.56999999999999995,4,2171.6268234395975,1003.9358161480975,1167.6910072915,578.10396025981947]
[358,"VSNoCode","Commercial HVAC","2 - 2.9 HP",48.000000000000007,4,"Commercial",4000,0.36520827043091608,1.25,1,1,0.96,0.56999999999999995,5,2171.6268234395975,984.99363093775582,1186.6331925018417,596.09088025981953]
[359,"VSNoCode","Commercial HVAC","2 - 2.9 HP",49.000000000000007,5,"Commercial",4000,0.36520827043091608,1.25,1,1,0.96,0.56999999999999995,6,2171.6268234395975,966.05144572741449,1205.5753777121831,614.07780025981947]
[360,"VSNoCode","Commercial HVAC","2 - 2.9 HP",50.000000000000007,6,"Commercial",4000,0.36520827043091608,1.25,1,1,0.96,0.56999999999999995,7,2171.6268234395975,947.10926051707304,1224.5175629225246,632.06472025981952]
[361,"VSNoCode","Commercial HVAC","3 - 5.9 HP",46.999999999999993,1,"Commercial",4000,0.33664183851667306,1.25,1,1,0.96,0.55000000000000004,2,2265.987697988387,1049.1141995491112,1216.8734984392759,364.05407872711908]
[362,"VSNoCode","Commercial HVAC","3 - 5.9 HP",47.999999999999993,2,"Commercial",4000,0.33664183851667306,1.25,1,1,0.96,0.55000000000000004,3,2265.987697988387,1029.3195920104488,1236.6681059779382,374.09827672711913]
[363,"VSNoCode","Commercial HVAC","3 - 5.9 HP",48.999999999999993,3,"Commercial",4000,0.33664183851667306,1.25,1,1,0.96,0.55000000000000004,4,2265.987697988387,1009.5249844717864,1256.4627135166006,384.14247472711912]
[364,"VSNoCode","Commercial HVAC","3 - 5.9 HP",49.999999999999993,4,"Commercial",4000,0.33664183851667306,1.25,1,1,0.96,0.55000000000000004,5,2265.987697988387,989.73037693312403,1276.257321055263,394.18667272711912]
[365,"VSNoCode","Commercial HVAC","3 - 5.9 HP",50.999999999999993,5,"Commercial",4000,0.33664183851667306,1.25,1,1,0.96,0.55000000000000004,6,2265.987697988387,969.93576939446143,1296.0519285939256,404.23087072711911]
[366,"VSNoCode","Commercial HVAC","3 - 5.9 HP",51.999999999999993,6,"Commercial",4000,0.33664183851667306,1.25,1,1,0.96,0.55000000000000004,7,2265.987697988387,950.14116185579906,1315.846536132588,414.27506872711911]
[367,"VSNoCode","Commercial HVAC","6 - 20 HP",50,1,"Commercial",4000,0.28489689669884105,1.25,1,1,0.96,0.52,2,2437.3036415383021,1066.9338301253292,1370.3698114129729,171.62051556131019]
[368,"VSNoCode","Commercial HVAC","6 - 20 HP",51,2,"Commercial",4000,0.28489689669884105,1.25,1,1,0.96,0.52,3,2437.3036415383021,1045.5951535228226,1391.7084880154796,177.22834656131019]
[369,"VSNoCode","Commercial HVAC","6 - 20 HP",52,3,"Commercial",4000,0.28489689669884105,1.25,1,1,0.96,0.52,4,2437.3036415383021,1024.2564769203161,1413.047164617986,182.83617756131019]
[370,"VSNoCode","Commercial HVAC","6 - 20 HP",53,4,"Commercial",4000,0.28489689669884105,1.25,1,1,0.96,0.52,5,2437.3036415383021,1002.9178003178096,1434.3858412204927,188.44400856131017]
[371,"VSNoCode","Commercial HVAC","6 - 20 HP",54,5,"Commercial",4000,0.28489689669884105,1.25,1,1,0.96,0.52,6,2437.3036415383021,981.57912371530279,1455.7245178229994,194.05183956131017]
[372,"VSNoCode","Commercial HVAC","6 - 20 HP",55,6,"Commercial",4000,0.28489689669884105,1.25,1,1,0.96,0.52,7,2437.3036415383021,960.24044711279623,1477.063194425506,199.65967056131018]
[373,"VSNoCode","Commercial HVAC","20.1 - 200 HP",50,1,"Commercial",4000,0.18127456833253794,1.25,1,1,0.96,0.52,2,2790.4821931429165,1221.5383440478533,1568.9438490950631,104.77137279106299]
[374,"VSNoCode","Commercial HVAC","20.1 - 200 HP",51,2,"Commercial",4000,0.18127456833253794,1.25,1,1,0.96,0.52,3,2790.4821931429165,1197.1075771668964,1593.3746159760201,107.54078089889353]
[375,"VSNoCode","Commercial HVAC","20.1 - 200 HP",52,3,"Commercial",4000,0.18127456833253794,1.25,1,1,0.96,0.52,4,2790.4821931429165,1172.6768102859392,1617.8053828569773,110.31018900672409]
[376,"VSNoCode","Commercial HVAC","20.1 - 200 HP",53,4,"Commercial",4000,0.18127456833253794,1.25,1,1,0.96,0.52,5,2790.4821931429165,1148.2460434049822,1642.2361497379343,113.07959711455463]
[377,"VSNoCode","Commercial HVAC","20.1 - 200 HP",54,5,"Commercial",4000,0.18127456833253794,1.25,1,1,0.96,0.52,6,2790.4821931429165,1123.8152765240252,1666.6669166188913,115.84900522238519]
[378,"VSNoCode","Commercial HVAC","20.1 - 200 HP",55,6,"Commercial",4000,0.18127456833253794,1.25,1,1,0.96,0.52,7,2790.4821931429165,1099.384509643068,1691.0976834998485,118.61841333021573]
[379,"VSNoCode","Commercial DHW","1 - 1.9 HP",44.000000000000007,1,"Commercial",6000,0.39003439574594323,1.25,1,1,0.96,0.57999999999999996,2,3132.3653950168004,1528.9153849990482,1603.4500100177522,1046.5813341018306]
[380,"VSNoCode","Commercial DHW","1 - 1.9 HP",45.000000000000007,2,"Commercial",6000,0.39003439574594323,1.25,1,1,0.96,0.57999999999999996,3,3132.3653950168004,1501.6133245526369,1630.7520704641636,1080.0539001018308]
[381,"VSNoCode","Commercial DHW","1 - 1.9 HP",46.000000000000007,3,"Commercial",6000,0.39003439574594323,1.25,1,1,0.96,0.57999999999999996,4,3132.3653950168004,1474.3112641062253,1658.0541309105752,1113.5264661018307]
[382,"VSNoCode","Commercial DHW","1 - 1.9 HP",47.000000000000007,4,"Commercial",6000,0.39003439574594323,1.25,1,1,0.96,0.57999999999999996,5,3132.3653950168004,1447.0092036598135,1685.356191356987,1146.9990321018306]
[383,"VSNoCode","Commercial DHW","1 - 1.9 HP",48.000000000000007,5,"Commercial",6000,0.39003439574594323,1.25,1,1,0.96,0.57999999999999996,6,3132.3653950168004,1419.7071432134019,1712.6582518033986,1180.4715981018308]
[384,"VSNoCode","Commercial DHW","1 - 1.9 HP",49.000000000000007,6,"Commercial",6000,0.39003439574594323,1.25,1,1,0.96,0.57999999999999996,7,3132.3653950168004,1392.4050827669903,1739.9603122498102,1213.9441641018307]
[385,"VSNoCode","Commercial DHW","2 - 2.9 HP",45.000000000000007,1,"Commercial",6000,0.36520827043091608,1.25,1,1,0.96,0.56999999999999995,2,3257.4402351593967,1562.7302798531705,1694.7099553062262,542.13012025981948]
[386,"VSNoCode","Commercial DHW","2 - 2.9 HP",46.000000000000007,2,"Commercial",6000,0.36520827043091608,1.25,1,1,0.96,0.56999999999999995,3,3257.4402351593967,1534.3170020376583,1723.1232331217384,560.11704025981953]
[387,"VSNoCode","Commercial DHW","2 - 2.9 HP",47.000000000000007,3,"Commercial",6000,0.36520827043091608,1.25,1,1,0.96,0.56999999999999995,4,3257.4402351593967,1505.9037242221461,1751.5365109372506,578.10396025981947]
[388,"VSNoCode","Commercial DHW","2 - 2.9 HP",48.000000000000007,4,"Commercial",6000,0.36520827043091608,1.25,1,1,0.96,0.56999999999999995,5,3257.4402351593967,1477.490446406634,1779.9497887527627,596.09088025981953]
[389,"VSNoCode","Commercial DHW","2 - 2.9 HP",49.000000000000007,5,"Commercial",6000,0.36520827043091608,1.25,1,1,0.96,0.56999999999999995,6,3257.4402351593967,1449.0771685911218,1808.3630665682749,614.07780025981947]
[390,"VSNoCode","Commercial DHW","2 - 2.9 HP",50.000000000000007,6,"Commercial",6000,0.36520827043091608,1.25,1,1,0.96,0.56999999999999995,7,3257.4402351593967,1420.6638907756096,1836.7763443837871,632.06472025981952]
[391,"VSNoCode","Commercial DHW","3 - 5.9 HP",46.999999999999993,1,"Commercial",6000,0.33664183851667306,1.25,1,1,0.96,0.55000000000000004,2,3398.9815469825808,1573.671299323667,1825.3102476589138,364.05407872711908]
[392,"VSNoCode","Commercial DHW","3 - 5.9 HP",47.999999999999993,2,"Commercial",6000,0.33664183851667306,1.25,1,1,0.96,0.55000000000000004,3,3398.9815469825808,1543.9793880156731,1855.0021589669077,374.09827672711913]
[393,"VSNoCode","Commercial DHW","3 - 5.9 HP",48.999999999999993,3,"Commercial",6000,0.33664183851667306,1.25,1,1,0.96,0.55000000000000004,4,3398.9815469825808,1514.2874767076798,1884.6940702749009,384.14247472711912]
[394,"VSNoCode","Commercial DHW","3 - 5.9 HP",49.999999999999993,4,"Commercial",6000,0.33664183851667306,1.25,1,1,0.96,0.55000000000000004,5,3398.9815469825808,1484.5955653996859,1914.3859815828948,394.18667272711912]
[395,"VSNoCode","Commercial DHW","3 - 5.9 HP",50.999999999999993,5,"Commercial",6000,0.33664183851667306,1.25,1,1,0.96,0.55000000000000004,6,3398.9815469825808,1454.903654091692,1944.0778928908887,404.23087072711911]
[396,"VSNoCode","Commercial DHW","3 - 5.9 HP",51.999999999999993,6,"Commercial",6000,0.33664183851667306,1.25,1,1,0.96,0.55000000000000004,7,3398.9815469825808,1425.2117427836986,1973.7698041988822,414.27506872711911]
[397,"VSNoCode","Commercial DHW","6 - 20 HP",50,1,"Commercial",6000,0.28489689669884105,1.25,1,1,0.96,0.52,2,3655.9554623074532,1600.4007451879936,2055.5547171194594,171.62051556131019]
[398,"VSNoCode","Commercial DHW","6 - 20 HP",51,2,"Commercial",6000,0.28489689669884105,1.25,1,1,0.96,0.52,3,3655.9554623074532,1568.3927302842339,2087.5627320232193,177.22834656131019]
[399,"VSNoCode","Commercial DHW","6 - 20 HP",52,3,"Commercial",6000,0.28489689669884105,1.25,1,1,0.96,0.52,4,3655.9554623074532,1536.3847153804741,2119.5707469269792,182.83617756131019]
[400,"VSNoCode","Commercial DHW","6 - 20 HP",53,4,"Commercial",6000,0.28489689669884105,1.25,1,1,0.96,0.52,5,3655.9554623074532,1504.3767004767142,2151.578761830739,188.44400856131017]
[401,"VSNoCode","Commercial DHW","6 - 20 HP",54,5,"Commercial",6000,0.28489689669884105,1.25,1,1,0.96,0.52,6,3655.9554623074532,1472.3686855729543,2183.5867767344989,194.05183956131017]
[402,"VSNoCode","Commercial DHW","6 - 20 HP",55,6,"Commercial",6000,0.28489689669884105,1.25,1,1,0.96,0.52,7,3655.9554623074532,1440.3606706691944,2215.5947916382588,199.65967056131018]
[403,"VSNoCode","Commercial DHW","20.1 - 200 HP",50,1,"Commercial",6000,0.18127456833253794,1.25,1,1,0.96,0.52,2,4185.723289714374,1832.3075160717801,2353.4157736425941,104.77137279106299]
[404,"VSNoCode","Commercial DHW","20.1 - 200 HP",51,2,"Commercial",6000,0.18127456833253794,1.25,1,1,0.96,0.52,3,4185.723289714374,1795.6613657503444,2390.0619239640296,107.54078089889353]
[405,"VSNoCode","Commercial DHW","20.1 - 200 HP",52,3,"Commercial",6000,0.18127456833253794,1.25,1,1,0.96,0.52,4,4185.723289714374,1759.015215428909,2426.708074285465,110.31018900672409]
[406,"VSNoCode","Commercial DHW","20.1 - 200 HP",53,4,"Commercial",6000,0.18127456833253794,1.25,1,1,0.96,0.52,5,4185.723289714374,1722.3690651074733,2463.354224606901,113.07959711455463]
[407,"VSNoCode","Commercial DHW","20.1 - 200 HP",54,5,"Commercial",6000,0.18127456833253794,1.25,1,1,0.96,0.52,6,4185.723289714374,1685.7229147860376,2500.0003749283364,115.84900522238519]
[408,"VSNoCode","Commercial DHW","20.1 - 200 HP",55,6,"Commercial",6000,0.18127456833253794,1.25,1,1,0.96,0.52,7,4185.723289714374,1649.0767644646021,2536.6465252497719,118.61841333021573]
[409,"VSNoCode","Municipal","1 - 1.9 HP",44.000000000000007,1,"Municipal",3400,0.39003439574594323,0.84,0.99,0.99,0.96,0.57999999999999996,2,1217.0595106941435,857.7215309844662,359.33797970967726,1046.5813341018306]
[410,"VSNoCode","Municipal","1 - 1.9 HP",45.000000000000007,2,"Municipal",3400,0.39003439574594323,0.84,0.99,0.99,0.96,0.57999999999999996,3,1217.0595106941435,842.40507507402924,374.65443562011421,1080.0539001018308]
[411,"VSNoCode","Municipal","1 - 1.9 HP",46.000000000000007,3,"Municipal",3400,0.39003439574594323,0.84,0.99,0.99,0.96,0.57999999999999996,4,1217.0595106941435,827.0886191635924,389.97089153055106,1113.5264661018307]
[412,"VSNoCode","Municipal","1 - 1.9 HP",47.000000000000007,4,"Municipal",3400,0.39003439574594323,0.84,0.99,0.99,0.96,0.57999999999999996,5,1217.0595106941435,811.77216325315544,405.28734744098801,1146.9990321018306]
[413,"VSNoCode","Municipal","1 - 1.9 HP",48.000000000000007,5,"Municipal",3400,0.39003439574594323,0.84,0.99,0.99,0.96,0.57999999999999996,6,1217.0595106941435,796.45570734271848,420.60380335142497,1180.4715981018308]
[414,"VSNoCode","Municipal","1 - 1.9 HP",49.000000000000007,6,"Municipal",3400,0.39003439574594323,0.84,0.99,0.99,0.96,0.57999999999999996,7,1217.0595106941435,781.13925143228164,435.92025926186182,1213.9441641018307]
[415,"VSNoCode","Municipal","2 - 2.9 HP",45.000000000000007,1,"Municipal",3400,0.36520827043091608,0.84,0.99,0.99,0.96,0.56999999999999995,2,1265.2399935978092,876.69168699762872,388.54830660018047,542.13012025981948]
[416,"VSNoCode","Municipal","2 - 2.9 HP",46.000000000000007,2,"Municipal",3400,0.36520827043091608,0.84,0.99,0.99,0.96,0.56999999999999995,3,1265.2399935978092,860.75183814312641,404.48815545468278,560.11704025981953]
[417,"VSNoCode","Municipal","2 - 2.9 HP",47.000000000000007,3,"Municipal",3400,0.36520827043091608,0.84,0.99,0.99,0.96,0.56999999999999995,4,1265.2399935978092,844.81198928862398,420.42800430918521,578.10396025981947]
[418,"VSNoCode","Municipal","2 - 2.9 HP",48.000000000000007,4,"Municipal",3400,0.36520827043091608,0.84,0.99,0.99,0.96,0.56999999999999995,5,1265.2399935978092,828.87214043412166,436.36785316368753,596.09088025981953]
[419,"VSNoCode","Municipal","2 - 2.9 HP",49.000000000000007,5,"Municipal",3400,0.36520827043091608,0.84,0.99,0.99,0.96,0.56999999999999995,6,1265.2399935978092,812.93229157961923,452.30770201818996,614.07780025981947]
[420,"VSNoCode","Municipal","2 - 2.9 HP",50.000000000000007,6,"Municipal",3400,0.36520827043091608,0.84,0.99,0.99,0.96,0.56999999999999995,7,1265.2399935978092,796.99244272511692,468.24755087269227,632.06472025981952]
[421,"VSNoCode","Municipal","3 - 5.9 HP",46.999999999999993,1,"Municipal",3400,0.33664183851667306,0.84,0.99,0.99,0.96,0.55000000000000004,2,1319.3456783937163,882.82959892057704,436.51607947313926,364.05407872711908]
[422,"VSNoCode","Municipal","3 - 5.9 HP",47.999999999999993,2,"Municipal",3400,0.33664183851667306,0.84,0.99,0.99,0.96,0.55000000000000004,3,1319.3456783937163,866.17243667679259,453.17324171692371,374.09827672711913]
[423,"VSNoCode","Municipal","3 - 5.9 HP",48.999999999999993,3,"Municipal",3400,0.33664183851667306,0.84,0.99,0.99,0.96,0.55000000000000004,4,1319.3456783937163,849.51527443300836,469.83040396070794,384.14247472711912]
[424,"VSNoCode","Municipal","3 - 5.9 HP",49.999999999999993,4,"Municipal",3400,0.33664183851667306,0.84,0.99,0.99,0.96,0.55000000000000004,5,1319.3456783937163,832.8581121892239,486.4875662044924,394.18667272711912]
[425,"VSNoCode","Municipal","3 - 5.9 HP",50.999999999999993,5,"Municipal",3400,0.33664183851667306,0.84,0.99,0.99,0.96,0.55000000000000004,6,1319.3456783937163,816.20094994543933,503.14472844827696,404.23087072711911]
[426,"VSNoCode","Municipal","3 - 5.9 HP",51.999999999999993,6,"Municipal",3400,0.33664183851667306,0.84,0.99,0.99,0.96,0.55000000000000004,7,1319.3456783937163,799.54378770165488,519.80189069206142,414.27506872711911]
[427,"VSNoCode","Municipal","6 - 20 HP",50,1,"Municipal",3400,0.28489689669884105,0.84,0.99,0.99,0.96,0.52,2,1417.6817117892842,897.82481805046461,519.85689373881962,171.62051556131019]
[428,"VSNoCode","Municipal","6 - 20 HP",51,2,"Municipal",3400,0.28489689669884105,0.84,0.99,0.99,0.96,0.52,3,1417.6817117892842,879.86832168945523,537.81339009982901,177.22834656131019]
[429,"VSNoCode","Municipal","6 - 20 HP",52,3,"Municipal",3400,0.28489689669884105,0.84,0.99,0.99,0.96,0.52,4,1417.6817117892842,861.91182532844607,555.76988646083817,182.83617756131019]
[430,"VSNoCode","Municipal","6 - 20 HP",53,4,"Municipal",3400,0.28489689669884105,0.84,0.99,0.99,0.96,0.52,5,1417.6817117892842,843.95532896743669,573.72638282184755,188.44400856131017]
[431,"VSNoCode","Municipal","6 - 20 HP",54,5,"Municipal",3400,0.28489689669884105,0.84,0.99,0.99,0.96,0.52,6,1417.6817117892842,825.99883260642741,591.68287918285682,194.05183956131017]
[432,"VSNoCode","Municipal","6 - 20 HP",55,6,"Municipal",3400,0.28489689669884105,0.84,0.99,0.99,0.96,0.52,7,1417.6817117892842,808.04233624541814,609.63937554386609,199.65967056131018]
[433,"VSNoCode","Municipal","20.1 - 200 HP",50,1,"Municipal",3400,0.18127456833253794,0.84,0.99,0.99,0.96,0.52,2,1623.111501115852,1027.9245165162686,595.18698459958341,104.77137279106299]
[434,"VSNoCode","Municipal","20.1 - 200 HP",51,2,"Municipal",3400,0.18127456833253794,0.84,0.99,0.99,0.96,0.52,3,1623.111501115852,1007.366026185943,615.74547492990894,107.54078089889353]
[435,"VSNoCode","Municipal","20.1 - 200 HP",52,3,"Municipal",3400,0.18127456833253794,0.84,0.99,0.99,0.96,0.52,4,1623.111501115852,986.80753585561786,636.30396526023412,110.31018900672409]
[436,"VSNoCode","Municipal","20.1 - 200 HP",53,4,"Municipal",3400,0.18127456833253794,0.84,0.99,0.99,0.96,0.52,5,1623.111501115852,966.24904552529256,656.86245559055942,113.07959711455463]
[437,"VSNoCode","Municipal","20.1 - 200 HP",54,5,"Municipal",3400,0.18127456833253794,0.84,0.99,0.99,0.96,0.52,6,1623.111501115852,945.69055519496703,677.42094592088495,115.84900522238519]
[438,"VSNoCode","Municipal","20.1 - 200 HP",55,6,"Municipal",3400,0.18127456833253794,0.84,0.99,0.99,0.96,0.52,7,1623.111501115852,925.13206486464185,697.97943625121013,118.61841333021573]
[439,"VSNoCode","Industrial BFW","1 - 1.9 HP",44.000000000000007,1,"Industrial",4000,0.39003439574594323,1.31,1.214,1.214,0.96,0.57999999999999996,2,2203.3749294704949,1237.4021849258963,965.97274454459853,1046.5813341018306]
[440,"VSNoCode","Industrial BFW","1 - 1.9 HP",45.000000000000007,2,"Industrial",4000,0.39003439574594323,1.31,1.214,1.214,0.96,0.57999999999999996,3,2203.3749294704949,1215.3057173379339,988.06921213256101,1080.0539001018308]
[441,"VSNoCode","Industrial BFW","1 - 1.9 HP",46.000000000000007,3,"Industrial",4000,0.39003439574594323,1.31,1.214,1.214,0.96,0.57999999999999996,4,2203.3749294704949,1193.2092497499716,1010.1656797205233,1113.5264661018307]
[442,"VSNoCode","Industrial BFW","1 - 1.9 HP",47.000000000000007,4,"Industrial",4000,0.39003439574594323,1.31,1.214,1.214,0.96,0.57999999999999996,5,2203.3749294704949,1171.1127821620091,1032.2621473084857,1146.9990321018306]
[443,"VSNoCode","Industrial BFW","1 - 1.9 HP",48.000000000000007,5,"Industrial",4000,0.39003439574594323,1.31,1.214,1.214,0.96,0.57999999999999996,6,2203.3749294704949,1149.0163145740466,1054.3586148964482,1180.4715981018308]
[444,"VSNoCode","Industrial BFW","1 - 1.9 HP",49.000000000000007,6,"Industrial",4000,0.39003439574594323,1.31,1.214,1.214,0.96,0.57999999999999996,7,2203.3749294704949,1126.9198469860842,1076.4550824844107,1213.9441641018307]
[445,"VSNoCode","Industrial BFW","2 - 2.9 HP",45.000000000000007,1,"Industrial",4000,0.36520827043091608,1.31,1.214,1.214,0.96,0.56999999999999995,2,2291.0995422638193,1264.7697064944991,1026.3298357693202,542.13012025981948]
[446,"VSNoCode","Industrial BFW","2 - 2.9 HP",46.000000000000007,2,"Industrial",4000,0.36520827043091608,1.31,1.214,1.214,0.96,0.56999999999999995,3,2291.0995422638193,1241.7738936491446,1049.3256486146747,560.11704025981953]
[447,"VSNoCode","Industrial BFW","2 - 2.9 HP",47.000000000000007,3,"Industrial",4000,0.36520827043091608,1.31,1.214,1.214,0.96,0.56999999999999995,4,2291.0995422638193,1218.7780808037903,1072.321461460029,578.10396025981947]
[448,"VSNoCode","Industrial BFW","2 - 2.9 HP",48.000000000000007,4,"Industrial",4000,0.36520827043091608,1.31,1.214,1.214,0.96,0.56999999999999995,5,2291.0995422638193,1195.7822679584356,1095.3172743053838,596.09088025981953]
[449,"VSNoCode","Industrial BFW","2 - 2.9 HP",49.000000000000007,5,"Industrial",4000,0.36520827043091608,1.31,1.214,1.214,0.96,0.56999999999999995,6,2291.0995422638193,1172.786455113081,1118.3130871507383,614.07780025981947]
[450,"VSNoCode","Industrial BFW","2 - 2.9 HP",50.000000000000007,6,"Industrial",4000,0.36520827043091608,1.31,1.214,1.214,0.96,0.56999999999999995,7,2291.0995422638193,1149.7906422677268,1141.3088999960926,632.06472025981952]
[451,"VSNoCode","Industrial BFW","3 - 5.9 HP",46.999999999999993,1,"Industrial",4000,0.33664183851667306,1.31,1.214,1.214,0.96,0.55000000000000004,2,2390.1167126722094,1273.624638252621,1116.4920744195883,364.05407872711908]
[452,"VSNoCode","Industrial BFW","3 - 5.9 HP",47.999999999999993,2,"Industrial",4000,0.33664183851667306,1.31,1.214,1.214,0.96,0.55000000000000004,3,2390.1167126722094,1249.5939847006848,1140.5227279715245,374.09827672711913]
[453,"VSNoCode","Industrial BFW","3 - 5.9 HP",48.999999999999993,3,"Industrial",4000,0.33664183851667306,1.31,1.214,1.214,0.96,0.55000000000000004,4,2390.1167126722094,1225.5633311487486,1164.5533815234608,384.14247472711912]
[454,"VSNoCode","Industrial BFW","3 - 5.9 HP",49.999999999999993,4,"Industrial",4000,0.33664183851667306,1.31,1.214,1.214,0.96,0.55000000000000004,5,2390.1167126722094,1201.5326775968126,1188.5840350753967,394.18667272711912]
[455,"VSNoCode","Industrial BFW","3 - 5.9 HP",50.999999999999993,5,"Industrial",4000,0.33664183851667306,1.31,1.214,1.214,0.96,0.55000000000000004,6,2390.1167126722094,1177.5020240448762,1212.6146886273332,404.23087072711911]
[456,"VSNoCode","Industrial BFW","3 - 5.9 HP",51.999999999999993,6,"Industrial",4000,0.33664183851667306,1.31,1.214,1.214,0.96,0.55000000000000004,7,2390.1167126722094,1153.47137049294,1236.6453421792694,414.27506872711911]
[457,"VSNoCode","Industrial BFW","6 - 20 HP",50,1,"Industrial",4000,0.28489689669884105,1.31,1.214,1.214,0.96,0.52,2,2569.950830128932,1295.2576697721497,1274.6931603567823,171.62051556131019]
[458,"VSNoCode","Industrial BFW","6 - 20 HP",51,2,"Industrial",4000,0.28489689669884105,1.31,1.214,1.214,0.96,0.52,3,2569.950830128932,1269.3525163767065,1300.5983137522255,177.22834656131019]
[459,"VSNoCode","Industrial BFW","6 - 20 HP",52,3,"Industrial",4000,0.28489689669884105,1.31,1.214,1.214,0.96,0.52,4,2569.950830128932,1243.4473629812637,1326.5034671476683,182.83617756131019]
[460,"VSNoCode","Industrial BFW","6 - 20 HP",53,4,"Industrial",4000,0.28489689669884105,1.31,1.214,1.214,0.96,0.52,5,2569.950830128932,1217.5422095858207,1352.4086205431113,188.44400856131017]
[461,"VSNoCode","Industrial BFW","6 - 20 HP",54,5,"Industrial",4000,0.28489689669884105,1.31,1.214,1.214,0.96,0.52,6,2569.950830128932,1191.6370561903775,1378.3137739385545,194.05183956131017]
[462,"VSNoCode","Industrial BFW","6 - 20 HP",55,6,"Industrial",4000,0.28489689669884105,1.31,1.214,1.214,0.96,0.52,7,2569.950830128932,1165.7319027949345,1404.2189273339975,199.65967056131018]
[463,"VSNoCode","Industrial BFW","20.1 - 200 HP",50,1,"Industrial",4000,0.18127456833253794,1.31,1.214,1.214,0.96,0.52,2,2942.3506806896726,1482.9475496740938,1459.4031310155788,104.77137279106299]
[464,"VSNoCode","Industrial BFW","20.1 - 200 HP",51,2,"Industrial",4000,0.18127456833253794,1.31,1.214,1.214,0.96,0.52,3,2942.3506806896726,1453.288598680612,1489.0620820090605,107.54078089889353]
[465,"VSNoCode","Industrial BFW","20.1 - 200 HP",52,3,"Industrial",4000,0.18127456833253794,1.31,1.214,1.214,0.96,0.52,4,2942.3506806896726,1423.62964768713,1518.7210330025425,110.31018900672409]
[466,"VSNoCode","Industrial BFW","20.1 - 200 HP",53,4,"Industrial",4000,0.18127456833253794,1.31,1.214,1.214,0.96,0.52,5,2942.3506806896726,1393.9706966936483,1548.3799839960243,113.07959711455463]
[467,"VSNoCode","Industrial BFW","20.1 - 200 HP",54,5,"Industrial",4000,0.18127456833253794,1.31,1.214,1.214,0.96,0.52,6,2942.3506806896726,1364.3117457001665,1578.0389349895061,115.84900522238519]
[468,"VSNoCode","Industrial BFW","20.1 - 200 HP",55,6,"Industrial",4000,0.18127456833253794,1.31,1.214,1.214,0.96,0.52,7,2942.3506806896726,1334.6527947066845,1607.6978859829881,118.61841333021573]
[469,"VSNoCode","Industrial General","1 - 1.9 HP",44.000000000000007,1,"Industrial",6800,0.39003439574594323,1.31,1.214,1.214,0.96,0.57999999999999996,2,3745.7373800998416,2103.5837143740241,1642.1536657258175,1046.5813341018306]
[470,"VSNoCode","Industrial General","1 - 1.9 HP",45.000000000000007,2,"Industrial",6800,0.39003439574594323,1.31,1.214,1.214,0.96,0.57999999999999996,3,3745.7373800998416,2066.0197194744878,1679.7176606253538,1080.0539001018308]
[471,"VSNoCode","Industrial General","1 - 1.9 HP",46.000000000000007,3,"Industrial",6800,0.39003439574594323,1.31,1.214,1.214,0.96,0.57999999999999996,4,3745.7373800998416,2028.4557245749518,1717.2816555248899,1113.5264661018307]
[472,"VSNoCode","Industrial General","1 - 1.9 HP",47.000000000000007,4,"Industrial",6800,0.39003439574594323,1.31,1.214,1.214,0.96,0.57999999999999996,5,3745.7373800998416,1990.8917296754155,1754.8456504244261,1146.9990321018306]
[473,"VSNoCode","Industrial General","1 - 1.9 HP",48.000000000000007,5,"Industrial",6800,0.39003439574594323,1.31,1.214,1.214,0.96,0.57999999999999996,6,3745.7373800998416,1953.3277347758792,1792.4096453239624,1180.4715981018308]
[474,"VSNoCode","Industrial General","1 - 1.9 HP",49.000000000000007,6,"Industrial",6800,0.39003439574594323,1.31,1.214,1.214,0.96,0.57999999999999996,7,3745.7373800998416,1915.7637398763432,1829.9736402234985,1213.9441641018307]
[475,"VSNoCode","Industrial General","2 - 2.9 HP",45.000000000000007,1,"Industrial",6800,0.36520827043091608,1.31,1.214,1.214,0.96,0.56999999999999995,2,3894.8692218484925,2150.1085010406491,1744.7607208078434,542.13012025981948]
[476,"VSNoCode","Industrial General","2 - 2.9 HP",46.000000000000007,2,"Industrial",6800,0.36520827043091608,1.31,1.214,1.214,0.96,0.56999999999999995,3,3894.8692218484925,2111.0156192035465,1783.853602644946,560.11704025981953]
[477,"VSNoCode","Industrial General","2 - 2.9 HP",47.000000000000007,3,"Industrial",6800,0.36520827043091608,1.31,1.214,1.214,0.96,0.56999999999999995,4,3894.8692218484925,2071.9227373664435,1822.9464844820491,578.10396025981947]
[478,"VSNoCode","Industrial General","2 - 2.9 HP",48.000000000000007,4,"Industrial",6800,0.36520827043091608,1.31,1.214,1.214,0.96,0.56999999999999995,5,3894.8692218484925,2032.8298555293409,1862.0393663191517,596.09088025981953]
[479,"VSNoCode","Industrial General","2 - 2.9 HP",49.000000000000007,5,"Industrial",6800,0.36520827043091608,1.31,1.214,1.214,0.96,0.56999999999999995,6,3894.8692218484925,1993.7369736922378,1901.1322481562547,614.07780025981947]
[480,"VSNoCode","Industrial General","2 - 2.9 HP",50.000000000000007,6,"Industrial",6800,0.36520827043091608,1.31,1.214,1.214,0.96,0.56999999999999995,7,3894.8692218484925,1954.6440918551352,1940.2251299933573,632.06472025981952]
[481,"VSNoCode","Industrial General","3 - 5.9 HP",46.999999999999993,1,"Industrial",6800,0.33664183851667306,1.31,1.214,1.214,0.96,0.55000000000000004,2,4063.1984115427554,2165.1618850294558,1898.0365265132996,364.05407872711908]
[482,"VSNoCode","Industrial General","3 - 5.9 HP",47.999999999999993,2,"Industrial",6800,0.33664183851667306,1.31,1.214,1.214,0.96,0.55000000000000004,3,4063.1984115427554,2124.3097739911641,1938.8886375515913,374.09827672711913]
[483,"VSNoCode","Industrial General","3 - 5.9 HP",48.999999999999993,3,"Industrial",6800,0.33664183851667306,1.31,1.214,1.214,0.96,0.55000000000000004,4,4063.1984115427554,2083.4576629528729,1979.7407485898825,384.14247472711912]
[484,"VSNoCode","Industrial General","3 - 5.9 HP",49.999999999999993,4,"Industrial",6800,0.33664183851667306,1.31,1.214,1.214,0.96,0.55000000000000004,5,4063.1984115427554,2042.6055519145814,2020.592859628174,394.18667272711912]
[485,"VSNoCode","Industrial General","3 - 5.9 HP",50.999999999999993,5,"Industrial",6800,0.33664183851667306,1.31,1.214,1.214,0.96,0.55000000000000004,6,4063.1984115427554,2001.7534408762897,2061.4449706664655,404.23087072711911]
[486,"VSNoCode","Industrial General","3 - 5.9 HP",51.999999999999993,6,"Industrial",6800,0.33664183851667306,1.31,1.214,1.214,0.96,0.55000000000000004,7,4063.1984115427554,1960.9013298379978,2102.2970817047576,414.27506872711911]
[487,"VSNoCode","Industrial General","6 - 20 HP",50,1,"Industrial",6800,0.28489689669884105,1.31,1.214,1.214,0.96,0.52,2,4368.9164112191847,2201.9380386126545,2166.9783726065302,171.62051556131019]
[488,"VSNoCode","Industrial General","6 - 20 HP",51,2,"Industrial",6800,0.28489689669884105,1.31,1.214,1.214,0.96,0.52,3,4368.9164112191847,2157.8992778404013,2211.0171333787835,177.22834656131019]
[489,"VSNoCode","Industrial General","6 - 20 HP",52,3,"Industrial",6800,0.28489689669884105,1.31,1.214,1.214,0.96,0.52,4,4368.9164112191847,2113.8605170681485,2255.0558941510362,182.83617756131019]
[490,"VSNoCode","Industrial General","6 - 20 HP",53,4,"Industrial",6800,0.28489689669884105,1.31,1.214,1.214,0.96,0.52,5,4368.9164112191847,2069.8217562958953,2299.0946549232895,188.44400856131017]
[491,"VSNoCode","Industrial General","6 - 20 HP",54,5,"Industrial",6800,0.28489689669884105,1.31,1.214,1.214,0.96,0.52,6,4368.9164112191847,2025.7829955236421,2343.1334156955427,194.05183956131017]
[492,"VSNoCode","Industrial General","6 - 20 HP",55,6,"Industrial",6800,0.28489689669884105,1.31,1.214,1.214,0.96,0.52,7,4368.9164112191847,1981.7442347513893,2387.1721764677955,199.65967056131018]
[493,"VSNoCode","Industrial General","20.1 - 200 HP",50,1,"Industrial",6800,0.18127456833253794,1.31,1.214,1.214,0.96,0.52,2,5001.9961571724434,2521.0108344459595,2480.9853227264839,104.77137279106299]
[494,"VSNoCode","Industrial General","20.1 - 200 HP",51,2,"Industrial",6800,0.18127456833253794,1.31,1.214,1.214,0.96,0.52,3,5001.9961571724434,2470.59061775704,2531.4055394154034,107.54078089889353]
[495,"VSNoCode","Industrial General","20.1 - 200 HP",52,3,"Industrial",6800,0.18127456833253794,1.31,1.214,1.214,0.96,0.52,4,5001.9961571724434,2420.1704010681215,2581.825756104322,110.31018900672409]
[496,"VSNoCode","Industrial General","20.1 - 200 HP",53,4,"Industrial",6800,0.18127456833253794,1.31,1.214,1.214,0.96,0.52,5,5001.9961571724434,2369.750184379202,2632.2459727932414,113.07959711455463]
[497,"VSNoCode","Industrial General","20.1 - 200 HP",54,5,"Industrial",6800,0.18127456833253794,1.31,1.214,1.214,0.96,0.52,6,5001.9961571724434,2319.329967690283,2682.6661894821605,115.84900522238519]
[498,"VSNoCode","Industrial General","20.1 - 200 HP",55,6,"Industrial",6800,0.18127456833253794,1.31,1.214,1.214,0.96,0.52,7,5001.9961571724434,2268.9097510013639,2733.0864061710795,118.61841333021573]
[499,"VSNoCode","Agricultural","1 - 1.9 HP",44.000000000000007,1,"Agricultural",2400,0.39003439574594323,1.325,1.845,1.845,0.96,0.57999999999999996,2,1370.3870630993777,1128.3395541292975,242.04750897008012,1046.5813341018306]
[500,"VSNoCode","Agricultural","1 - 1.9 HP",45.000000000000007,2,"Agricultural",2400,0.39003439574594323,1.325,1.845,1.845,0.96,0.57999999999999996,3,1370.3870630993777,1108.190633519846,262.1964295795317,1080.0539001018308]
[501,"VSNoCode","Agricultural","1 - 1.9 HP",46.000000000000007,3,"Agricultural",2400,0.39003439574594323,1.325,1.845,1.845,0.96,0.57999999999999996,4,1370.3870630993777,1088.0417129103942,282.3453501889835,1113.5264661018307]
[502,"VSNoCode","Agricultural","1 - 1.9 HP",47.000000000000007,4,"Agricultural",2400,0.39003439574594323,1.325,1.845,1.845,0.96,0.57999999999999996,5,1370.3870630993777,1067.8927923009426,302.49427079843508,1146.9990321018306]
[503,"VSNoCode","Agricultural","1 - 1.9 HP",48.000000000000007,5,"Agricultural",2400,0.39003439574594323,1.325,1.845,1.845,0.96,0.57999999999999996,6,1370.3870630993777,1047.7438716914908,322.64319140788689,1180.4715981018308]
[504,"VSNoCode","Agricultural","1 - 1.9 HP",49.000000000000007,6,"Agricultural",2400,0.39003439574594323,1.325,1.845,1.845,0.96,0.57999999999999996,7,1370.3870630993777,1027.594951082039,342.7921120173387,1213.9441641018307]
[505,"VSNoCode","Agricultural","2 - 2.9 HP",45.000000000000007,1,"Agricultural",2400,0.36520827043091608,1.325,1.845,1.845,0.96,0.56999999999999995,2,1424.3806316466569,1153.2949465316397,271.08568511501721,542.13012025981948]
[506,"VSNoCode","Agricultural","2 - 2.9 HP",46.000000000000007,2,"Agricultural",2400,0.36520827043091608,1.325,1.845,1.845,0.96,0.56999999999999995,3,1424.3806316466569,1132.3259475037919,292.05468414286497,560.11704025981953]
[507,"VSNoCode","Agricultural","2 - 2.9 HP",47.000000000000007,3,"Agricultural",2400,0.36520827043091608,1.325,1.845,1.845,0.96,0.56999999999999995,4,1424.3806316466569,1111.3569484759439,313.02368317071296,578.10396025981947]
[508,"VSNoCode","Agricultural","2 - 2.9 HP",48.000000000000007,4,"Agricultural",2400,0.36520827043091608,1.325,1.845,1.845,0.96,0.56999999999999995,5,1424.3806316466569,1090.3879494480957,333.99268219856117,596.09088025981953]
[509,"VSNoCode","Agricultural","2 - 2.9 HP",49.000000000000007,5,"Agricultural",2400,0.36520827043091608,1.325,1.845,1.845,0.96,0.56999999999999995,6,1424.3806316466569,1069.4189504202479,354.96168122640893,614.07780025981947]
[510,"VSNoCode","Agricultural","2 - 2.9 HP",50.000000000000007,6,"Agricultural",2400,0.36520827043091608,1.325,1.845,1.845,0.96,0.56999999999999995,7,1424.3806316466569,1048.4499513924,375.93068025425691,632.06472025981952]
[511,"VSNoCode","Agricultural","3 - 5.9 HP",46.999999999999993,1,"Agricultural",2400,0.33664183851667306,1.325,1.845,1.845,0.96,0.55000000000000004,2,1484.7544171251834,1161.3694189008661,323.38499822431731,364.05407872711908]
[512,"VSNoCode","Agricultural","3 - 5.9 HP",47.999999999999993,2,"Agricultural",2400,0.33664183851667306,1.325,1.845,1.845,0.96,0.55000000000000004,3,1484.7544171251834,1139.4567883555667,345.29762876961672,374.09827672711913]
[513,"VSNoCode","Agricultural","3 - 5.9 HP",48.999999999999993,3,"Agricultural",2400,0.33664183851667306,1.325,1.845,1.845,0.96,0.55000000000000004,4,1484.7544171251834,1117.5441578102675,367.2102593149159,384.14247472711912]
[514,"VSNoCode","Agricultural","3 - 5.9 HP",49.999999999999993,4,"Agricultural",2400,0.33664183851667306,1.325,1.845,1.845,0.96,0.55000000000000004,5,1484.7544171251834,1095.6315272649681,389.12288986021531,394.18667272711912]
[515,"VSNoCode","Agricultural","3 - 5.9 HP",50.999999999999993,5,"Agricultural",2400,0.33664183851667306,1.325,1.845,1.845,0.96,0.55000000000000004,6,1484.7544171251834,1073.7188967196687,411.03552040551472,404.23087072711911]
[516,"VSNoCode","Agricultural","3 - 5.9 HP",51.999999999999993,6,"Agricultural",2400,0.33664183851667306,1.325,1.845,1.845,0.96,0.55000000000000004,7,1484.7544171251834,1051.8062661743695,432.9481509508139,414.27506872711911]
[517,"VSNoCode","Agricultural","6 - 20 HP",50,1,"Agricultural",2400,0.28489689669884105,1.325,1.845,1.845,0.96,0.52,2,1594.5483997429906,1181.0957499487395,413.4526497942511,171.62051556131019]
[518,"VSNoCode","Agricultural","6 - 20 HP",51,2,"Agricultural",2400,0.28489689669884105,1.325,1.845,1.845,0.96,0.52,3,1594.5483997429906,1157.4738349497648,437.07456479322582,177.22834656131019]
[519,"VSNoCode","Agricultural","6 - 20 HP",52,3,"Agricultural",2400,0.28489689669884105,1.325,1.845,1.845,0.96,0.52,4,1594.5483997429906,1133.8519199507898,460.69647979220076,182.83617756131019]
[520,"VSNoCode","Agricultural","6 - 20 HP",53,4,"Agricultural",2400,0.28489689669884105,1.325,1.845,1.845,0.96,0.52,5,1594.5483997429906,1110.2300049518151,484.31839479117548,188.44400856131017]
[521,"VSNoCode","Agricultural","6 - 20 HP",54,5,"Agricultural",2400,0.28489689669884105,1.325,1.845,1.845,0.96,0.52,6,1594.5483997429906,1086.6080899528401,507.94030979015042,194.05183956131017]
[522,"VSNoCode","Agricultural","6 - 20 HP",55,6,"Agricultural",2400,0.28489689669884105,1.325,1.845,1.845,0.96,0.52,7,1594.5483997429906,1062.9861749538654,531.56222478912514,199.65967056131018]
[523,"VSNoCode","Agricultural","20.1 - 200 HP",50,1,"Agricultural",2400,0.18127456833253794,1.325,1.845,1.845,0.96,0.52,2,1825.6071339470091,1352.2429468609737,473.36418708603537,104.77137279106299]
[524,"VSNoCode","Agricultural","20.1 - 200 HP",51,2,"Agricultural",2400,0.18127456833253794,1.325,1.845,1.845,0.96,0.52,3,1825.6071339470091,1325.1980879237542,500.40904602325486,107.54078089889353]
[525,"VSNoCode","Agricultural","20.1 - 200 HP",52,3,"Agricultural",2400,0.18127456833253794,1.325,1.845,1.845,0.96,0.52,4,1825.6071339470091,1298.1532289865347,527.45390496047435,110.31018900672409]
[526,"VSNoCode","Agricultural","20.1 - 200 HP",53,4,"Agricultural",2400,0.18127456833253794,1.325,1.845,1.845,0.96,0.52,5,1825.6071339470091,1271.1083700493152,554.49876389769383,113.07959711455463]
[527,"VSNoCode","Agricultural","20.1 - 200 HP",54,5,"Agricultural",2400,0.18127456833253794,1.325,1.845,1.845,0.96,0.52,6,1825.6071339470091,1244.0635111120957,581.54362283491332,115.84900522238519]
[528,"VSNoCode","Agricultural","20.1 - 200 HP",55,6,"Agricultural",2400,0.18127456833253794,1.325,1.845,1.845,0.96,0.52,7,1825.6071339470091,1217.0186521748763,608.58848177213281,118.61841333021573]

{"sheet":"Lifetime","index":8,"n_rows":7,"n_cols":3,"rows_kept":7,"cut":false,"hidden":true,"merged":[]}
[]
[null,"Pump Code","Lifetime"]
[null,"ESCC",11.221]
[null,"ESFM",22.992999999999995]
[null,"IL",15.290000000000003]
[null,"RSV",10.5]
[null,"ST",10.500000000000002]

{"sheet":"Lists","index":9,"n_rows":54,"n_cols":37,"rows_kept":54,"cut":false,"hidden":true,"merged":[]}
["State",null,"Sector",null,"Pump Type","Pump Code",null,"Nominal Speed","Nominal Speed_For measures",null,"Equipped with VSD","Speed Control_hpBins","Speed Control_measures",null,null,null,"VS Horsepower","Variable Speed",null,"CS Horsepower","Constant Speed",null,null,"CS_VS ",null,null,"Motor Horsepower",null,null,null,"flow","=>","<",null,"Head","=>","<"]
[null,null,null,null,null,null,null,"1800 RPM",1800,null,{"$f":"\"\"","v":""},null,null,null,null,null,"User Enterd","MotorHP Range",null,"User Entered","MotorHP Range",null,"User Entered","MotorHP Range",250,null,null,null,null,null,"0-50",1,50,null,"0-50",1,50]
["Unknown",null,"Commercial HVAC",null,"End Suction Close Coupled","ESCC",null,"3600 RPM",3600,null,"No","ConstantSpeed","Constant Speed","CS",null,null,200,"50.1 - 200 HP",null,200,"50.1 - 200 HP",null,200,"20.1 - 200 HP",200,null,1,null,null,null,"50-100",50,100,null,"50-100",50,100]
["Alabama",null,"Commercial DHW",null,"End Suction Frame Mounted","ESFM",null,null,null,null,"Yes","VariableSpeed","Variable Speed","VSCode",null,null,50,"6 - 50 HP",null,50,"20 - 50 HP",null,20,"6 - 20 HP",150,null,1.5,null,null,null,"100-150",100,150,null,"100+",100,10000000000]
["Alaska",null,"Municipal",null,"In Line","IL",null,null,null,null,null,null,null,null,null,null,5.9,"3 - 5.9 HP",null,19.899999999999999,"3 - 19.9 HP",null,5.9,"3 - 5.9 HP",125,null,2,null,null,null,"150-200",150,200]
["Arizona",null,"Industrial BFW",null,"Radial Split Vertical","RSV",null,null,null,null,null,null,null,null,null,null,2.9,"2 - 2.9 HP",null,2.9,"1 - 2.9 HP",null,2.9,"2 - 2.9 HP",100,null,3,null,null,null,"200-300",200,300]
["Arkansas",null,"Industrial General",null,"Submersible Turbine","ST",null,null,null,null,null,null,null,null,null,null,1.9,"1 - 1.9 HP",null,null,null,null,1.9,"1 - 1.9 HP",75,null,5,null,null,null,"300-800",300,800]
["California",null,"Agricultural",null,null,null,null,null,null,null,null,null,null,null,null,null,null,null,null,null,null,null,null,null,60,null,7.5,null,null,null,"800+",800,100000000]
["Colorado",null,null,null,null,null,null,null,null,null,null,null,null,null,null,null,null,null,null,null,null,null,null,null,50,null,10]
["Connecticut",null,null,null,null,null,null,null,null,null,null,null,null,null,null,null,null,null,null,null,null,null,null,null,40,null,15]
["District of Columbia",null,null,null,null,null,null,null,null,null,null,null,null,null,null,null,null,null,null,null,null,null,null,null,30,null,20]
["Delaware",null,null,null,null,null,null,null,null,null,null,null,null,null,null,null,null,null,null,null,null,null,null,null,25,null,25]
["Florida",null,null,null,null,null,null,null,null,null,null,null,null,null,null,null,null,null,null,null,null,null,null,null,20,null,30]
["Georgia",null,null,null,null,null,null,null,null,null,null,null,null,null,null,null,null,null,null,null,null,null,null,null,15,null,40,null,null,19,{"$f":"INDEX(Lists!$AI$2:$AI$4,MATCH(AD14,Lists!$AJ$2:$AJ$4,1))","v":"0-50"}]
["Hawaii",null,null,null,null,null,null,null,null,null,null,null,null,null,null,null,null,null,null,null,null,null,null,null,10,null,50,null,null,49,{"$f":"INDEX($AE$2:$AE$8,MATCH(AD15,$AF$2:$AF$8,1))","v":"0-50"}]
["Idaho",null,null,null,null,null,null,null,null,null,null,null,null,null,null,null,null,null,null,null,null,null,null,null,7.5,null,60,null,null,70,"50-100"]
["Illinois",null,null,null,null,null,null,null,null,null,null,null,null,null,null,null,null,null,null,null,null,null,null,null,5,null,75,null,null,100,"100-150"]
["Indiana",null,null,null,null,null,null,null,null,null,null,null,null,null,null,null,null,null,null,null,null,null,null,null,3,null,100,null,null,900,"800+"]
["Iowa",null,null,null,null,null,null,null,null,null,null,null,null,null,null,null,null,null,null,null,null,null,null,null,2,null,125,null,null,800,"800+"]
["Kansas",null,null,null,null,null,null,null,null,null,null,null,null,null,null,null,null,null,null,null,null,null,null,null,1.5,null,150,null,null,799,"300-800"]
["Kentucky",null,null,null,null,null,null,null,null,null,null,null,null,null,null,null,null,null,null,null,null,null,null,null,1,null,200]
["Louisiana"]
["Maine"]
["Maryland"]
["Massachusetts"]
["Michigan"]
["Minnesota"]
["Mississippi"]
["Missouri"]
["Montana"]
["Nebraska"]
["Nevada"]
["New Hampshire"]
["New Jersey"]
["New Mexico"]
["New York"]
["North Carolina"]
["North Dakota"]
["Ohio"]
["Oklahoma"]
["Oregon"]
["Pennsylvania"]
["Rhode Island"]
["South Carolina"]
["South Dakota"]
["Tennessee"]
["Texas"]
["Utah"]
["Vermont"]
["Virginia"]
["Washington"]
["West Virginia"]
["Wisconsin"]
["Wyoming"]

{"sheet":"Site-specific Lists","index":10,"n_rows":54,"n_cols":51,"rows_kept":54,"cut":false,"hidden":true,"merged":[[0,16,0,19]]}
["Pumping Applications","Operating Hours",null,"Motor Horsepower",null,"Pump Speed Control",null,"Pump Type",null,"Nominal Speed",null,"State",null,"Horsepower Bin","Motor Oversizing Factor",null,"Incremental ER Increase Cost",null,null,null,null,null,null,null,null,"VS Horsepower","VS-->VS",null,"CS Horsepower","cs->cs",null,null,"CS_VS ",null,null,"Application","Constant Speed","Variable speed",null,"Pump Code","Lifetime",null,null,"Horsepower bin",null,"$/HP",null,null,null,"Baseline ER List","Efficient Case ER"]
[null,null,null,null,null,null,null,null,null,null,null,null,null,null,null,null,null,null,null,null,null,null,null,null,null,"User Enterd","MotorHP Range",null,"User Entered","MotorHP Range",null,"User Entered","MotorHP Range",null,null,null,null,null,null,null,null,null,null,1,"1 - 1.9 HP",868.29981318176397]
["Commercial HVAC",4000,null,1,null,"Constant Speed Control",null,"End Suction Close Coupled",null,"1800 RPM",null,"Unknown",null,null,null,null,"Speed Control Case","Motor HP Bin","Incremental Cost increase ($2020)","Units",null,null,null,null,null,200,"50.1 - 200 HP",null,200,"50.1 - 200 HP",null,200,"20.1 - 200 HP",null,null,"Agricultural",1.325,1.845,null,"End Suction Close Coupled",11.221,null,null,2,"2 - 2.9 HP",448.63123948199433,null,null,null,{"$f":"IF('Site Specific Savings'!H22=\"Variable Speed Control\",34,0)","v":0},{"$f":"IF('Site Specific Savings'!I22=\"Variable Speed Control\",34,0)","v":0}]
["Commercial DHW",6000,null,1.5,null,"Variable Speed Control",null,"End Suction Frame Mounted",null,"3600 RPM",null,"Alabama",null,"1 - 1.9 HP",0.39003439574594323,null,"CS->CS","1 - 2.9 HP",21.699344314354455,"$/ΔER/HP",null,"Motor HP",null,"2020",null,50,"6 - 50 HP",null,50,"20 - 50 HP",null,20,"6 - 20 HP",null,null,"Commercial HVAC",1.25,1,null,"End Suction Frame Mounted",22.992999999999995,null,null,3,"3 - 5.9 HP",304.87372497270155,null,null,null,{"$f":"AX3+1","v":1},{"$f":"AY3+1","v":1}]
["Municipal",3400,null,2,null,null,null,"In Line",null,null,null,"Alaska",null,"1 - 2.9 HP",0.37605304702478665,null,"CS->CS","3 - 19.9 HP",7.4220867283475824,"$/ΔER/HP",null,"1 - 1.9 HP",979.63620210183069,"$/HP",null,5.9,"3 - 5.9 HP",null,19.899999999999999,"3 - 19.9 HP",null,5.9,"3 - 5.9 HP",null,null,"Commercial DHW",1.25,1,null,"In Line",15.290000000000003,null,null,6,"6 - 20 HP",142.17472167923833,null,null,null,{"$f":"AX4+1","v":2},2]
["Industrial BFW",4000,null,3,null,null,null,"Radial Split Vertical ",null,null,null,"Arizona",null,"2 - 2.9 HP",0.36520827043091608,null,"CS->CS","20 - 50 HP",3.1459643741439685,"$/ΔER/HP",null,"2 - 2.9 HP",506.15628025981948,"$/HP",null,2.9,"2 - 2.9 HP",null,2.9,"1 - 2.9 HP",null,2.9,"2 - 2.9 HP",null,null,"Industrial BFW",1.31,1.214,null,"Radial Split Vertical ",10.5,null,null,20.100000000000001,"20.1 - 200 HP",87.954702114013742,null,null,null,3,3]
["Industrial General",6800,null,5,null,null,null,"Submersible Turbine",null,null,null,"Arkansas",null,"3 - 5.9 HP",0.33664183851667306,null,"CS->CS","50.1 - 200 HP",1.1744718740714775,"$/ΔER/HP",null,"3 - 5.9 HP",343.96568272711909,"$/HP",null,1.9,"1 - 1.9 HP",null,null,null,null,1.9,"1 - 1.9 HP",null,null,"Industrial General",1.31,1.214,null,"Submersible Turbine",10.500000000000002,null,null,null,null,null,null,null,null,4,4]
["Agricultural",2400,null,7.5,null,null,null,null,null,null,null,"California",null,"3 - 19.9 HP",0.29104193408105666,null,"VS->VS","1 - 1.9 HP",33.472566,"$/ΔER/HP",null,"6 - 20 HP",160.4048535613102,"$/HP",null,null,null,null,null,null,null,null,null,null,null,"Municipal",0.84,0.99,null,null,null,null,null,null,null,null,null,null,null,5,5]
["Unknown",{"$f":"AVERAGE(B3:B8)","v":4433.333333333333},null,10,null,null,null,null,null,null,null,"Colorado",null,"6 - 20 HP",0.28489689669884105,null,"VS->VS","2 - 2.9 HP",17.986920000000005,"$/ΔER/HP",null,"20.1 - 200 HP",99.232556575401887,"$/HP",null,null,null,null,null,null,null,null,null,null,null,"Unknown",{"$f":"AVERAGE(AK3:AK8)","v":1.2141666666666666},{"$f":"AVERAGE(AL3:AL8)","v":1.2104999999999999},null,null,null,null,null,null,null,null,null,null,null,6,6]
[null,null,null,15,null,null,null,null,null,null,null,"Connecticut",null,"6 - 50 HP",0.24770815248632091,null,"VS->VS","3 - 5.9 HP",10.044198000000003,"$/ΔER/HP",null,null,null,null,null,null,null,null,null,null,null,null,null,null,null,null,null,null,null,null,null,null,null,null,null,null,null,null,null,7,7]
[null,null,null,20,null,null,null,null,null,null,null,"District of Columbia",null,"20 - 50 HP",0.23688070518484289,null,"VS->VS","6 - 50 HP",4.6663824828664424,"$/ΔER/HP",null,null,null,null,null,null,null,null,null,null,null,null,null,null,null,null,null,null,null,null,null,null,null,null,null,null,null,null,null,8,8]
[null,null,null,25,null,null,null,null,null,null,null,"Delaware",null,"20.1 - 200 HP",0.18127456833253794,null,"VS->VS","50.1 - 200 HP",1.1744718740714775,"$/ΔER/HP",null,null,null,null,null,null,null,null,null,null,null,null,null,null,null,null,null,null,null,null,null,null,null,null,null,null,null,null,null,9,9]
[null,null,null,30,null,null,null,null,null,null,null,"Florida",null,"50.1 - 200 HP",0.17506451625407168,null,"CS->VS","1 - 1.9 HP",33.472566,"$/ΔER/HP",null,null,null,null,null,null,null,null,null,null,null,null,null,null,null,null,null,null,null,null,null,null,null,null,null,null,null,null,null,10,10]
[null,null,null,40,null,null,null,null,null,null,null,"Georgia",null,null,null,null,"CS->VS","2 - 2.9 HP",17.986920000000005,"$/ΔER/HP",null,null,null,null,null,null,null,null,null,null,null,null,null,null,null,null,null,null,null,null,null,null,null,null,null,null,null,null,null,11,11]
[null,null,null,50,null,null,null,null,null,null,null,"Hawaii",null,null,null,null,"CS->VS","3 - 5.9 HP",10.044198000000003,"$/ΔER/HP",null,null,null,null,null,null,null,null,null,null,null,null,null,null,null,null,null,null,null,null,null,null,null,null,null,null,null,null,null,12,12]
[null,null,null,60,null,null,null,null,null,null,null,"Idaho",null,null,null,null,"CS->VS","6 - 20 HP",5.6078309999999938,"$/ΔER/HP",null,null,null,null,null,null,null,null,null,null,null,null,null,null,null,null,null,null,null,null,null,null,null,null,null,null,null,null,null,13,13]
[null,null,null,75,null,null,null,null,null,null,null,"Illinois",null,null,null,null,"CS->VS","20.1 - 200 HP",2.7694081078305488,"$/ΔER/HP",null,null,null,null,null,null,null,null,null,null,null,null,null,null,null,null,null,null,null,null,null,null,null,null,null,null,null,null,null,14,14]
[null,null,null,100,null,null,null,null,null,null,null,"Indiana",null,null,null,null,null,null,null,null,null,null,null,null,null,null,null,null,null,null,null,null,null,null,null,null,null,null,null,null,null,null,null,null,null,null,null,null,null,15,15]
[null,null,null,125,null,null,null,null,null,null,null,"Iowa",null,null,null,null,null,null,null,null,null,null,null,null,null,null,null,null,null,null,null,null,null,null,null,null,null,null,null,null,null,null,null,null,null,null,null,null,null,16,16]
[null,null,null,150,null,null,null,null,null,null,null,"Kansas",null,null,null,null,null,null,null,null,null,null,null,null,null,null,null,null,null,null,null,null,null,null,null,null,null,null,null,null,null,null,null,null,null,null,null,null,null,17,17]
[null,null,null,200,null,null,null,null,null,null,null,"Kentucky",null,null,null,null,null,null,null,null,null,null,null,null,null,null,null,null,null,null,null,null,null,null,null,null,null,null,null,null,null,null,null,null,null,null,null,null,null,18,18]
[null,null,null,250,null,null,null,null,null,null,null,"Louisiana",null,null,null,null,null,null,null,null,null,null,null,null,null,null,null,null,null,null,null,null,null,null,null,null,null,null,null,null,null,null,null,null,null,null,null,null,null,19,19]
[null,null,null,null,null,null,null,null,null,null,null,"Maine",null,null,null,null,null,null,null,null,null,null,null,null,null,null,null,null,null,null,null,null,null,null,null,null,null,null,null,null,null,null,null,null,null,null,null,null,null,20,20]
[null,null,null,null,null,null,null,null,null,null,null,"Maryland",null,null,null,null,null,null,null,null,null,null,null,null,null,null,null,null,null,null,null,null,null,null,null,null,null,null,null,null,null,null,null,null,null,null,null,null,null,21,21]
[null,null,null,null,null,null,null,null,null,null,null,"Massachusetts",null,null,null,null,null,null,null,null,null,null,null,null,null,null,null,null,null,null,null,null,null,null,null,null,null,null,null,null,null,null,null,null,null,null,null,null,null,22,22]
[null,null,null,null,null,null,null,null,null,null,null,"Michigan",null,null,null,null,null,null,null,null,null,null,null,null,null,null,null,null,null,null,null,null,null,null,null,null,null,null,null,null,null,null,null,null,null,null,null,null,null,23,23]
[null,null,null,null,null,null,null,null,null,null,null,"Minnesota",null,null,null,null,null,null,null,null,null,null,null,null,null,null,null,null,null,null,null,null,null,null,null,null,null,null,null,null,null,null,null,null,null,null,null,null,null,24,24]
[null,null,null,null,null,null,null,null,null,null,null,"Mississippi",null,null,null,null,null,null,null,null,null,null,null,null,null,null,null,null,null,null,null,null,null,null,null,null,null,null,null,null,null,null,null,null,null,null,null,null,null,25,25]
[null,null,null,null,null,null,null,null,null,null,null,"Missouri",null,null,null,null,null,null,null,null,null,null,null,null,null,null,null,null,null,null,null,null,null,null,null,null,null,null,null,null,null,null,null,null,null,null,null,null,null,26,26]
[null,null,null,null,null,null,null,null,null,null,null,"Montana",null,null,null,null,null,null,null,null,null,null,null,null,null,null,null,null,null,null,null,null,null,null,null,null,null,null,null,null,null,null,null,null,null,null,null,null,null,27,27]
[null,null,null,null,null,null,null,null,null,null,null,"Nebraska",null,null,null,null,null,null,null,null,null,null,null,null,null,null,null,null,null,null,null,null,null,null,null,null,null,null,null,null,null,null,null,null,null,null,null,null,null,28,28]
[null,null,null,null,null,null,null,null,null,null,null,"Nevada",null,null,null,null,null,null,null,null,null,null,null,null,null,null,null,null,null,null,null,null,null,null,null,null,null,null,null,null,null,null,null,null,null,null,null,null,null,29,29]
[null,null,null,null,null,null,null,null,null,null,null,"New Hampshire",null,null,null,null,null,null,null,null,null,null,null,null,null,null,null,null,null,null,null,null,null,null,null,null,null,null,null,null,null,null,null,null,null,null,null,null,null,{"$f":"AX32+1","v":30},{"$f":"AY32+1","v":30}]
[null,null,null,null,null,null,null,null,null,null,null,"New Jersey"]
[null,null,null,null,null,null,null,null,null,null,null,"New Mexico"]
[null,null,null,null,null,null,null,null,null,null,null,"New York"]
[null,null,null,null,null,null,null,null,null,null,null,"North Carolina"]
[null,null,null,null,null,null,null,null,null,null,null,"North Dakota"]
[null,null,null,null,null,null,null,null,null,null,null,"Ohio"]
[null,null,null,null,null,null,null,null,null,null,null,"Oklahoma"]
[null,null,null,null,null,null,null,null,null,null,null,"Oregon"]
[null,null,null,null,null,null,null,null,null,null,null,"Pennsylvania"]
[null,null,null,null,null,null,null,null,null,null,null,"Rhode Island"]
[null,null,null,null,null,null,null,null,null,null,null,"South Carolina"]
[null,null,null,null,null,null,null,null,null,null,null,"South Dakota"]
[null,null,null,null,null,null,null,null,null,null,null,"Tennessee"]
[null,null,null,null,null,null,null,null,null,null,null,"Texas"]
[null,null,null,null,null,null,null,null,null,null,null,"Utah"]
[null,null,null,null,null,null,null,null,null,null,null,"Vermont"]
[null,null,null,null,null,null,null,null,null,null,null,"Virginia"]
[null,null,null,null,null,null,null,null,null,null,null,"Washington"]
[null,null,null,null,null,null,null,null,null,null,null,"West Virginia"]
[null,null,null,null,null,null,null,null,null,null,null,"Wisconsin"]
[null,null,null,null,null,null,null,null,null,null,null,"Wyoming"]

{"sheet":"sample-llc","index":11,"n_rows":622,"n_cols":7,"rows_kept":622,"cut":false,"hidden":true,"merged":[]}
["speed","rated motor power","doe","max er"]
[{"$f":"lcc[[#This Row],[speed]]","v":"constant"},{"$f":"lcc[[#This Row],[rated motor power]]","v":1},{"$f":"lcc[[#This Row],[doe]]","v":"ESCC"},{"$f":"lcc[[#This Row],[max er]]","v":17},{"$f":"lcc[[#This Row],[Column1]]","v":""},{"$f":"lcc[[#This Row],[_1]]","v":""},{"$f":"lcc[[#This Row],[_2]]","v":""}]
[{"$f":"lcc[[#This Row],[speed]]","v":"constant"},{"$f":"lcc[[#This Row],[rated motor power]]","v":1},{"$f":"lcc[[#This Row],[doe]]","v":"ESFM"},{"$f":"lcc[[#This Row],[max er]]","v":3},{"$f":"lcc[[#This Row],[Column1]]","v":""},{"$f":"lcc[[#This Row],[_1]]","v":""},{"$f":"lcc[[#This Row],[_2]]","v":""}]
[{"$f":"lcc[[#This Row],[speed]]","v":"constant"},{"$f":"lcc[[#This Row],[rated motor power]]","v":1},{"$f":"lcc[[#This Row],[doe]]","v":"IL"},{"$f":"lcc[[#This Row],[max er]]","v":15},{"$f":"lcc[[#This Row],[Column1]]","v":""},{"$f":"lcc[[#This Row],[_1]]","v":""},{"$f":"lcc[[#This Row],[_2]]","v":""}]
[{"$f":"lcc[[#This Row],[speed]]","v":"constant"},{"$f":"lcc[[#This Row],[rated motor power]]","v":1},{"$f":"lcc[[#This Row],[doe]]","v":"RSV"},{"$f":"lcc[[#This Row],[max er]]","v":17},{"$f":"lcc[[#This Row],[Column1]]","v":""},{"$f":"lcc[[#This Row],[_1]]","v":""},{"$f":"lcc[[#This Row],[_2]]","v":""}]
[{"$f":"lcc[[#This Row],[speed]]","v":"constant"},{"$f":"lcc[[#This Row],[rated motor power]]","v":1},{"$f":"lcc[[#This Row],[doe]]","v":"ST"},{"$f":"lcc[[#This Row],[max er]]","v":"-"},{"$f":"lcc[[#This Row],[Column1]]","v":""},{"$f":"lcc[[#This Row],[_1]]","v":""},{"$f":"lcc[[#This Row],[_2]]","v":""}]
[{"$f":"lcc[[#This Row],[speed]]","v":"constant"},{"$f":"lcc[[#This Row],[rated motor power]]","v":1.5},{"$f":"lcc[[#This Row],[doe]]","v":"ESCC"},{"$f":"lcc[[#This Row],[max er]]","v":28},{"$f":"lcc[[#This Row],[Column1]]","v":""},{"$f":"lcc[[#This Row],[_1]]","v":""},{"$f":"lcc[[#This Row],[_2]]","v":""}]
[{"$f":"lcc[[#This Row],[speed]]","v":"constant"},{"$f":"lcc[[#This Row],[rated motor power]]","v":1.5},{"$f":"lcc[[#This Row],[doe]]","v":"ESFM"},{"$f":"lcc[[#This Row],[max er]]","v":30},{"$f":"lcc[[#This Row],[Column1]]","v":""},{"$f":"lcc[[#This Row],[_1]]","v":""},{"$f":"lcc[[#This Row],[_2]]","v":""}]
[{"$f":"lcc[[#This Row],[speed]]","v":"constant"},{"$f":"lcc[[#This Row],[rated motor power]]","v":1.5},{"$f":"lcc[[#This Row],[doe]]","v":"IL"},{"$f":"lcc[[#This Row],[max er]]","v":20},{"$f":"lcc[[#This Row],[Column1]]","v":""},{"$f":"lcc[[#This Row],[_1]]","v":""},{"$f":"lcc[[#This Row],[_2]]","v":""}]
[{"$f":"lcc[[#This Row],[speed]]","v":"constant"},{"$f":"lcc[[#This Row],[rated motor power]]","v":1.5},{"$f":"lcc[[#This Row],[doe]]","v":"RSV"},{"$f":"lcc[[#This Row],[max er]]","v":12},{"$f":"lcc[[#This Row],[Column1]]","v":""},{"$f":"lcc[[#This Row],[_1]]","v":""},{"$f":"lcc[[#This Row],[_2]]","v":""}]
[{"$f":"lcc[[#This Row],[speed]]","v":"constant"},{"$f":"lcc[[#This Row],[rated motor power]]","v":1.5},{"$f":"lcc[[#This Row],[doe]]","v":"ST"},{"$f":"lcc[[#This Row],[max er]]","v":12},{"$f":"lcc[[#This Row],[Column1]]","v":""},{"$f":"lcc[[#This Row],[_1]]","v":""},{"$f":"lcc[[#This Row],[_2]]","v":""}]
[{"$f":"lcc[[#This Row],[speed]]","v":"constant"},{"$f":"lcc[[#This Row],[rated motor power]]","v":2},{"$f":"lcc[[#This Row],[doe]]","v":"ESCC"},{"$f":"lcc[[#This Row],[max er]]","v":22},{"$f":"lcc[[#This Row],[Column1]]","v":""},{"$f":"lcc[[#This Row],[_1]]","v":""},{"$f":"lcc[[#This Row],[_2]]","v":""}]
[{"$f":"lcc[[#This Row],[speed]]","v":"constant"},{"$f":"lcc[[#This Row],[rated motor power]]","v":2},{"$f":"lcc[[#This Row],[doe]]","v":"ESFM"},{"$f":"lcc[[#This Row],[max er]]","v":22},{"$f":"lcc[[#This Row],[Column1]]","v":""},{"$f":"lcc[[#This Row],[_1]]","v":""},{"$f":"lcc[[#This Row],[_2]]","v":""}]
[{"$f":"lcc[[#This Row],[speed]]","v":"constant"},{"$f":"lcc[[#This Row],[rated motor power]]","v":2},{"$f":"lcc[[#This Row],[doe]]","v":"IL"},{"$f":"lcc[[#This Row],[max er]]","v":21},{"$f":"lcc[[#This Row],[Column1]]","v":""},{"$f":"lcc[[#This Row],[_1]]","v":""},{"$f":"lcc[[#This Row],[_2]]","v":""}]
[{"$f":"lcc[[#This Row],[speed]]","v":"constant"},{"$f":"lcc[[#This Row],[rated motor power]]","v":2},{"$f":"lcc[[#This Row],[doe]]","v":"RSV"},{"$f":"lcc[[#This Row],[max er]]","v":13},{"$f":"lcc[[#This Row],[Column1]]","v":""},{"$f":"lcc[[#This Row],[_1]]","v":""},{"$f":"lcc[[#This Row],[_2]]","v":""}]
[{"$f":"lcc[[#This Row],[speed]]","v":"constant"},{"$f":"lcc[[#This Row],[rated motor power]]","v":2},{"$f":"lcc[[#This Row],[doe]]","v":"ST"},{"$f":"lcc[[#This Row],[max er]]","v":13},{"$f":"lcc[[#This Row],[Column1]]","v":""},{"$f":"lcc[[#This Row],[_1]]","v":""},{"$f":"lcc[[#This Row],[_2]]","v":""}]
[{"$f":"lcc[[#This Row],[speed]]","v":"constant"},{"$f":"lcc[[#This Row],[rated motor power]]","v":3},{"$f":"lcc[[#This Row],[doe]]","v":"ESCC"},{"$f":"lcc[[#This Row],[max er]]","v":48},{"$f":"lcc[[#This Row],[Column1]]","v":""},{"$f":"lcc[[#This Row],[_1]]","v":""},{"$f":"lcc[[#This Row],[_2]]","v":""}]
[{"$f":"lcc[[#This Row],[speed]]","v":"constant"},{"$f":"lcc[[#This Row],[rated motor power]]","v":3},{"$f":"lcc[[#This Row],[doe]]","v":"ESFM"},{"$f":"lcc[[#This Row],[max er]]","v":48},{"$f":"lcc[[#This Row],[Column1]]","v":""},{"$f":"lcc[[#This Row],[_1]]","v":""},{"$f":"lcc[[#This Row],[_2]]","v":""}]
[{"$f":"lcc[[#This Row],[speed]]","v":"constant"},{"$f":"lcc[[#This Row],[rated motor power]]","v":3},{"$f":"lcc[[#This Row],[doe]]","v":"IL"},{"$f":"lcc[[#This Row],[max er]]","v":18},{"$f":"lcc[[#This Row],[Column1]]","v":""},{"$f":"lcc[[#This Row],[_1]]","v":""},{"$f":"lcc[[#This Row],[_2]]","v":""}]
[{"$f":"lcc[[#This Row],[speed]]","v":"constant"},{"$f":"lcc[[#This Row],[rated motor power]]","v":3},{"$f":"lcc[[#This Row],[doe]]","v":"RSV"},{"$f":"lcc[[#This Row],[max er]]","v":18},{"$f":"lcc[[#This Row],[Column1]]","v":""},{"$f":"lcc[[#This Row],[_1]]","v":""},{"$f":"lcc[[#This Row],[_2]]","v":""}]
[{"$f":"lcc[[#This Row],[speed]]","v":"constant"},{"$f":"lcc[[#This Row],[rated motor power]]","v":3},{"$f":"lcc[[#This Row],[doe]]","v":"ST"},{"$f":"lcc[[#This Row],[max er]]","v":25},{"$f":"lcc[[#This Row],[Column1]]","v":""},{"$f":"lcc[[#This Row],[_1]]","v":""},{"$f":"lcc[[#This Row],[_2]]","v":""}]
[{"$f":"lcc[[#This Row],[speed]]","v":"constant"},{"$f":"lcc[[#This Row],[rated motor power]]","v":5},{"$f":"lcc[[#This Row],[doe]]","v":"ESCC"},{"$f":"lcc[[#This Row],[max er]]","v":18},{"$f":"lcc[[#This Row],[Column1]]","v":""},{"$f":"lcc[[#This Row],[_1]]","v":""},{"$f":"lcc[[#This Row],[_2]]","v":""}]
[{"$f":"lcc[[#This Row],[speed]]","v":"constant"},{"$f":"lcc[[#This Row],[rated motor power]]","v":5},{"$f":"lcc[[#This Row],[doe]]","v":"ESFM"},{"$f":"lcc[[#This Row],[max er]]","v":20},{"$f":"lcc[[#This Row],[Column1]]","v":""},{"$f":"lcc[[#This Row],[_1]]","v":""},{"$f":"lcc[[#This Row],[_2]]","v":""}]
[{"$f":"lcc[[#This Row],[speed]]","v":"constant"},{"$f":"lcc[[#This Row],[rated motor power]]","v":5},{"$f":"lcc[[#This Row],[doe]]","v":"IL"},{"$f":"lcc[[#This Row],[max er]]","v":20},{"$f":"lcc[[#This Row],[Column1]]","v":""},{"$f":"lcc[[#This Row],[_1]]","v":""},{"$f":"lcc[[#This Row],[_2]]","v":""}]
[{"$f":"lcc[[#This Row],[speed]]","v":"constant"},{"$f":"lcc[[#This Row],[rated motor power]]","v":5},{"$f":"lcc[[#This Row],[doe]]","v":"RSV"},{"$f":"lcc[[#This Row],[max er]]","v":10},{"$f":"lcc[[#This Row],[Column1]]","v":""},{"$f":"lcc[[#This Row],[_1]]","v":""},{"$f":"lcc[[#This Row],[_2]]","v":""}]
[{"$f":"lcc[[#This Row],[speed]]","v":"constant"},{"$f":"lcc[[#This Row],[rated motor power]]","v":5},{"$f":"lcc[[#This Row],[doe]]","v":"ST"},{"$f":"lcc[[#This Row],[max er]]","v":16},{"$f":"lcc[[#This Row],[Column1]]","v":""},{"$f":"lcc[[#This Row],[_1]]","v":""},{"$f":"lcc[[#This Row],[_2]]","v":""}]
[{"$f":"lcc[[#This Row],[speed]]","v":"constant"},{"$f":"lcc[[#This Row],[rated motor power]]","v":7.5},{"$f":"lcc[[#This Row],[doe]]","v":"ESCC"},{"$f":"lcc[[#This Row],[max er]]","v":18},{"$f":"lcc[[#This Row],[Column1]]","v":""},{"$f":"lcc[[#This Row],[_1]]","v":""},{"$f":"lcc[[#This Row],[_2]]","v":""}]
[{"$f":"lcc[[#This Row],[speed]]","v":"constant"},{"$f":"lcc[[#This Row],[rated motor power]]","v":7.5},{"$f":"lcc[[#This Row],[doe]]","v":"ESFM"},{"$f":"lcc[[#This Row],[max er]]","v":19},{"$f":"lcc[[#This Row],[Column1]]","v":""},{"$f":"lcc[[#This Row],[_1]]","v":""},{"$f":"lcc[[#This Row],[_2]]","v":""}]
[{"$f":"lcc[[#This Row],[speed]]","v":"constant"},{"$f":"lcc[[#This Row],[rated motor power]]","v":7.5},{"$f":"lcc[[#This Row],[doe]]","v":"IL"},{"$f":"lcc[[#This Row],[max er]]","v":20},{"$f":"lcc[[#This Row],[Column1]]","v":""},{"$f":"lcc[[#This Row],[_1]]","v":""},{"$f":"lcc[[#This Row],[_2]]","v":""}]
[{"$f":"lcc[[#This Row],[speed]]","v":"constant"},{"$f":"lcc[[#This Row],[rated motor power]]","v":7.5},{"$f":"lcc[[#This Row],[doe]]","v":"RSV"},{"$f":"lcc[[#This Row],[max er]]","v":15},{"$f":"lcc[[#This Row],[Column1]]","v":""},{"$f":"lcc[[#This Row],[_1]]","v":""},{"$f":"lcc[[#This Row],[_2]]","v":""}]
[{"$f":"lcc[[#This Row],[speed]]","v":"constant"},{"$f":"lcc[[#This Row],[rated motor power]]","v":7.5},{"$f":"lcc[[#This Row],[doe]]","v":"ST"},{"$f":"lcc[[#This Row],[max er]]","v":14},{"$f":"lcc[[#This Row],[Column1]]","v":""},{"$f":"lcc[[#This Row],[_1]]","v":""},{"$f":"lcc[[#This Row],[_2]]","v":""}]
[{"$f":"lcc[[#This Row],[speed]]","v":"constant"},{"$f":"lcc[[#This Row],[rated motor power]]","v":10},{"$f":"lcc[[#This Row],[doe]]","v":"ESCC"},{"$f":"lcc[[#This Row],[max er]]","v":26},{"$f":"lcc[[#This Row],[Column1]]","v":""},{"$f":"lcc[[#This Row],[_1]]","v":""},{"$f":"lcc[[#This Row],[_2]]","v":""}]
[{"$f":"lcc[[#This Row],[speed]]","v":"constant"},{"$f":"lcc[[#This Row],[rated motor power]]","v":10},{"$f":"lcc[[#This Row],[doe]]","v":"ESFM"},{"$f":"lcc[[#This Row],[max er]]","v":15},{"$f":"lcc[[#This Row],[Column1]]","v":""},{"$f":"lcc[[#This Row],[_1]]","v":""},{"$f":"lcc[[#This Row],[_2]]","v":""}]
[{"$f":"lcc[[#This Row],[speed]]","v":"constant"},{"$f":"lcc[[#This Row],[rated motor power]]","v":10},{"$f":"lcc[[#This Row],[doe]]","v":"IL"},{"$f":"lcc[[#This Row],[max er]]","v":21},{"$f":"lcc[[#This Row],[Column1]]","v":""},{"$f":"lcc[[#This Row],[_1]]","v":""},{"$f":"lcc[[#This Row],[_2]]","v":""}]
[{"$f":"lcc[[#This Row],[speed]]","v":"constant"},{"$f":"lcc[[#This Row],[rated motor power]]","v":10},{"$f":"lcc[[#This Row],[doe]]","v":"RSV"},{"$f":"lcc[[#This Row],[max er]]","v":6},{"$f":"lcc[[#This Row],[Column1]]","v":""},{"$f":"lcc[[#This Row],[_1]]","v":""},{"$f":"lcc[[#This Row],[_2]]","v":""}]
[{"$f":"lcc[[#This Row],[speed]]","v":"constant"},{"$f":"lcc[[#This Row],[rated motor power]]","v":10},{"$f":"lcc[[#This Row],[doe]]","v":"ST"},{"$f":"lcc[[#This Row],[max er]]","v":15},{"$f":"lcc[[#This Row],[Column1]]","v":""},{"$f":"lcc[[#This Row],[_1]]","v":""},{"$f":"lcc[[#This Row],[_2]]","v":""}]
[{"$f":"lcc[[#This Row],[speed]]","v":"constant"},{"$f":"lcc[[#This Row],[rated motor power]]","v":15},{"$f":"lcc[[#This Row],[doe]]","v":"ESCC"},{"$f":"lcc[[#This Row],[max er]]","v":25},{"$f":"lcc[[#This Row],[Column1]]","v":""},{"$f":"lcc[[#This Row],[_1]]","v":""},{"$f":"lcc[[#This Row],[_2]]","v":""}]
[{"$f":"lcc[[#This Row],[speed]]","v":"constant"},{"$f":"lcc[[#This Row],[rated motor power]]","v":15},{"$f":"lcc[[#This Row],[doe]]","v":"ESFM"},{"$f":"lcc[[#This Row],[max er]]","v":25},{"$f":"lcc[[#This Row],[Column1]]","v":""},{"$f":"lcc[[#This Row],[_1]]","v":""},{"$f":"lcc[[#This Row],[_2]]","v":""}]
[{"$f":"lcc[[#This Row],[speed]]","v":"constant"},{"$f":"lcc[[#This Row],[rated motor power]]","v":15},{"$f":"lcc[[#This Row],[doe]]","v":"IL"},{"$f":"lcc[[#This Row],[max er]]","v":20},{"$f":"lcc[[#This Row],[Column1]]","v":""},{"$f":"lcc[[#This Row],[_1]]","v":""},{"$f":"lcc[[#This Row],[_2]]","v":""}]
[{"$f":"lcc[[#This Row],[speed]]","v":"constant"},{"$f":"lcc[[#This Row],[rated motor power]]","v":15},{"$f":"lcc[[#This Row],[doe]]","v":"RSV"},{"$f":"lcc[[#This Row],[max er]]","v":13},{"$f":"lcc[[#This Row],[Column1]]","v":""},{"$f":"lcc[[#This Row],[_1]]","v":""},{"$f":"lcc[[#This Row],[_2]]","v":""}]
[{"$f":"lcc[[#This Row],[speed]]","v":"constant"},{"$f":"lcc[[#This Row],[rated motor power]]","v":15},{"$f":"lcc[[#This Row],[doe]]","v":"ST"},{"$f":"lcc[[#This Row],[max er]]","v":18},{"$f":"lcc[[#This Row],[Column1]]","v":""},{"$f":"lcc[[#This Row],[_1]]","v":""},{"$f":"lcc[[#This Row],[_2]]","v":""}]
[{"$f":"lcc[[#This Row],[speed]]","v":"constant"},{"$f":"lcc[[#This Row],[rated motor power]]","v":20},{"$f":"lcc[[#This Row],[doe]]","v":"ESCC"},{"$f":"lcc[[#This Row],[max er]]","v":20},{"$f":"lcc[[#This Row],[Column1]]","v":""},{"$f":"lcc[[#This Row],[_1]]","v":""},{"$f":"lcc[[#This Row],[_2]]","v":""}]
[{"$f":"lcc[[#This Row],[speed]]","v":"constant"},{"$f":"lcc[[#This Row],[rated motor power]]","v":20},{"$f":"lcc[[#This Row],[doe]]","v":"ESFM"},{"$f":"lcc[[#This Row],[max er]]","v":20},{"$f":"lcc[[#This Row],[Column1]]","v":""},{"$f":"lcc[[#This Row],[_1]]","v":""},{"$f":"lcc[[#This Row],[_2]]","v":""}]
[{"$f":"lcc[[#This Row],[speed]]","v":"constant"},{"$f":"lcc[[#This Row],[rated motor power]]","v":20},{"$f":"lcc[[#This Row],[doe]]","v":"IL"},{"$f":"lcc[[#This Row],[max er]]","v":19},{"$f":"lcc[[#This Row],[Column1]]","v":""},{"$f":"lcc[[#This Row],[_1]]","v":""},{"$f":"lcc[[#This Row],[_2]]","v":""}]
[{"$f":"lcc[[#This Row],[speed]]","v":"constant"},{"$f":"lcc[[#This Row],[rated motor power]]","v":20},{"$f":"lcc[[#This Row],[doe]]","v":"RSV"},{"$f":"lcc[[#This Row],[max er]]","v":9},{"$f":"lcc[[#This Row],[Column1]]","v":""},{"$f":"lcc[[#This Row],[_1]]","v":""},{"$f":"lcc[[#This Row],[_2]]","v":""}]
[{"$f":"lcc[[#This Row],[speed]]","v":"constant"},{"$f":"lcc[[#This Row],[rated motor power]]","v":20},{"$f":"lcc[[#This Row],[doe]]","v":"ST"},{"$f":"lcc[[#This Row],[max er]]","v":9},{"$f":"lcc[[#This Row],[Column1]]","v":""},{"$f":"lcc[[#This Row],[_1]]","v":""},{"$f":"lcc[[#This Row],[_2]]","v":""}]
[{"$f":"lcc[[#This Row],[speed]]","v":"constant"},{"$f":"lcc[[#This Row],[rated motor power]]","v":25},{"$f":"lcc[[#This Row],[doe]]","v":"ESCC"},{"$f":"lcc[[#This Row],[max er]]","v":18},{"$f":"lcc[[#This Row],[Column1]]","v":""},{"$f":"lcc[[#This Row],[_1]]","v":""},{"$f":"lcc[[#This Row],[_2]]","v":""}]
[{"$f":"lcc[[#This Row],[speed]]","v":"constant"},{"$f":"lcc[[#This Row],[rated motor power]]","v":25},{"$f":"lcc[[#This Row],[doe]]","v":"ESFM"},{"$f":"lcc[[#This Row],[max er]]","v":19},{"$f":"lcc[[#This Row],[Column1]]","v":""},{"$f":"lcc[[#This Row],[_1]]","v":""},{"$f":"lcc[[#This Row],[_2]]","v":""}]
[{"$f":"lcc[[#This Row],[speed]]","v":"constant"},{"$f":"lcc[[#This Row],[rated motor power]]","v":25},{"$f":"lcc[[#This Row],[doe]]","v":"IL"},{"$f":"lcc[[#This Row],[max er]]","v":12},{"$f":"lcc[[#This Row],[Column1]]","v":""},{"$f":"lcc[[#This Row],[_1]]","v":""},{"$f":"lcc[[#This Row],[_2]]","v":""}]
[{"$f":"lcc[[#This Row],[speed]]","v":"constant"},{"$f":"lcc[[#This Row],[rated motor power]]","v":25},{"$f":"lcc[[#This Row],[doe]]","v":"RSV"},{"$f":"lcc[[#This Row],[max er]]","v":12},{"$f":"lcc[[#This Row],[Column1]]","v":""},{"$f":"lcc[[#This Row],[_1]]","v":""},{"$f":"lcc[[#This Row],[_2]]","v":""}]
[{"$f":"lcc[[#This Row],[speed]]","v":"constant"},{"$f":"lcc[[#This Row],[rated motor power]]","v":25},{"$f":"lcc[[#This Row],[doe]]","v":"ST"},{"$f":"lcc[[#This Row],[max er]]","v":10},{"$f":"lcc[[#This Row],[Column1]]","v":""},{"$f":"lcc[[#This Row],[_1]]","v":""},{"$f":"lcc[[#This Row],[_2]]","v":""}]
[{"$f":"lcc[[#This Row],[speed]]","v":"constant"},{"$f":"lcc[[#This Row],[rated motor power]]","v":30},{"$f":"lcc[[#This Row],[doe]]","v":"ESCC"},{"$f":"lcc[[#This Row],[max er]]","v":13},{"$f":"lcc[[#This Row],[Column1]]","v":""},{"$f":"lcc[[#This Row],[_1]]","v":""},{"$f":"lcc[[#This Row],[_2]]","v":""}]
[{"$f":"lcc[[#This Row],[speed]]","v":"constant"},{"$f":"lcc[[#This Row],[rated motor power]]","v":30},{"$f":"lcc[[#This Row],[doe]]","v":"ESFM"},{"$f":"lcc[[#This Row],[max er]]","v":13},{"$f":"lcc[[#This Row],[Column1]]","v":""},{"$f":"lcc[[#This Row],[_1]]","v":""},{"$f":"lcc[[#This Row],[_2]]","v":""}]
[{"$f":"lcc[[#This Row],[speed]]","v":"constant"},{"$f":"lcc[[#This Row],[rated motor power]]","v":30},{"$f":"lcc[[#This Row],[doe]]","v":"IL"},{"$f":"lcc[[#This Row],[max er]]","v":20},{"$f":"lcc[[#This Row],[Column1]]","v":""},{"$f":"lcc[[#This Row],[_1]]","v":""},{"$f":"lcc[[#This Row],[_2]]","v":""}]
[{"$f":"lcc[[#This Row],[speed]]","v":"constant"},{"$f":"lcc[[#This Row],[rated motor power]]","v":30},{"$f":"lcc[[#This Row],[doe]]","v":"RSV"},{"$f":"lcc[[#This Row],[max er]]","v":"-"},{"$f":"lcc[[#This Row],[Column1]]","v":""},{"$f":"lcc[[#This Row],[_1]]","v":""},{"$f":"lcc[[#This Row],[_2]]","v":""}]
[{"$f":"lcc[[#This Row],[speed]]","v":"constant"},{"$f":"lcc[[#This Row],[rated motor power]]","v":30},{"$f":"lcc[[#This Row],[doe]]","v":"ST"},{"$f":"lcc[[#This Row],[max er]]","v":8},{"$f":"lcc[[#This Row],[Column1]]","v":""},{"$f":"lcc[[#This Row],[_1]]","v":""},{"$f":"lcc[[#This Row],[_2]]","v":""}]
[{"$f":"lcc[[#This Row],[speed]]","v":"constant"},{"$f":"lcc[[#This Row],[rated motor power]]","v":40},{"$f":"lcc[[#This Row],[doe]]","v":"ESCC"},{"$f":"lcc[[#This Row],[max er]]","v":21},{"$f":"lcc[[#This Row],[Column1]]","v":""},{"$f":"lcc[[#This Row],[_1]]","v":""},{"$f":"lcc[[#This Row],[_2]]","v":""}]
[{"$f":"lcc[[#This Row],[speed]]","v":"constant"},{"$f":"lcc[[#This Row],[rated motor power]]","v":40},{"$f":"lcc[[#This Row],[doe]]","v":"ESFM"},{"$f":"lcc[[#This Row],[max er]]","v":20},{"$f":"lcc[[#This Row],[Column1]]","v":""},{"$f":"lcc[[#This Row],[_1]]","v":""},{"$f":"lcc[[#This Row],[_2]]","v":""}]
[{"$f":"lcc[[#This Row],[speed]]","v":"constant"},{"$f":"lcc[[#This Row],[rated motor power]]","v":40},{"$f":"lcc[[#This Row],[doe]]","v":"IL"},{"$f":"lcc[[#This Row],[max er]]","v":26},{"$f":"lcc[[#This Row],[Column1]]","v":""},{"$f":"lcc[[#This Row],[_1]]","v":""},{"$f":"lcc[[#This Row],[_2]]","v":""}]
[{"$f":"lcc[[#This Row],[speed]]","v":"constant"},{"$f":"lcc[[#This Row],[rated motor power]]","v":40},{"$f":"lcc[[#This Row],[doe]]","v":"RSV"},{"$f":"lcc[[#This Row],[max er]]","v":18},{"$f":"lcc[[#This Row],[Column1]]","v":""},{"$f":"lcc[[#This Row],[_1]]","v":""},{"$f":"lcc[[#This Row],[_2]]","v":""}]
[{"$f":"lcc[[#This Row],[speed]]","v":"constant"},{"$f":"lcc[[#This Row],[rated motor power]]","v":40},{"$f":"lcc[[#This Row],[doe]]","v":"ST"},{"$f":"lcc[[#This Row],[max er]]","v":9},{"$f":"lcc[[#This Row],[Column1]]","v":""},{"$f":"lcc[[#This Row],[_1]]","v":""},{"$f":"lcc[[#This Row],[_2]]","v":""}]
[{"$f":"lcc[[#This Row],[speed]]","v":"constant"},{"$f":"lcc[[#This Row],[rated motor power]]","v":50},{"$f":"lcc[[#This Row],[doe]]","v":"ESCC"},{"$f":"lcc[[#This Row],[max er]]","v":17},{"$f":"lcc[[#This Row],[Column1]]","v":""},{"$f":"lcc[[#This Row],[_1]]","v":""},{"$f":"lcc[[#This Row],[_2]]","v":""}]
[{"$f":"lcc[[#This Row],[speed]]","v":"constant"},{"$f":"lcc[[#This Row],[rated motor power]]","v":50},{"$f":"lcc[[#This Row],[doe]]","v":"ESFM"},{"$f":"lcc[[#This Row],[max er]]","v":18},{"$f":"lcc[[#This Row],[Column1]]","v":""},{"$f":"lcc[[#This Row],[_1]]","v":""},{"$f":"lcc[[#This Row],[_2]]","v":""}]
[{"$f":"lcc[[#This Row],[speed]]","v":"constant"},{"$f":"lcc[[#This Row],[rated motor power]]","v":50},{"$f":"lcc[[#This Row],[doe]]","v":"IL"},{"$f":"lcc[[#This Row],[max er]]","v":19},{"$f":"lcc[[#This Row],[Column1]]","v":""},{"$f":"lcc[[#This Row],[_1]]","v":""},{"$f":"lcc[[#This Row],[_2]]","v":""}]
[{"$f":"lcc[[#This Row],[speed]]","v":"constant"},{"$f":"lcc[[#This Row],[rated motor power]]","v":50},{"$f":"lcc[[#This Row],[doe]]","v":"RSV"},{"$f":"lcc[[#This Row],[max er]]","v":7},{"$f":"lcc[[#This Row],[Column1]]","v":""},{"$f":"lcc[[#This Row],[_1]]","v":""},{"$f":"lcc[[#This Row],[_2]]","v":""}]
[{"$f":"lcc[[#This Row],[speed]]","v":"constant"},{"$f":"lcc[[#This Row],[rated motor power]]","v":50},{"$f":"lcc[[#This Row],[doe]]","v":"ST"},{"$f":"lcc[[#This Row],[max er]]","v":10},{"$f":"lcc[[#This Row],[Column1]]","v":""},{"$f":"lcc[[#This Row],[_1]]","v":""},{"$f":"lcc[[#This Row],[_2]]","v":""}]
[{"$f":"lcc[[#This Row],[speed]]","v":"constant"},{"$f":"lcc[[#This Row],[rated motor power]]","v":60},{"$f":"lcc[[#This Row],[doe]]","v":"ESCC"},{"$f":"lcc[[#This Row],[max er]]","v":17},{"$f":"lcc[[#This Row],[Column1]]","v":""},{"$f":"lcc[[#This Row],[_1]]","v":""},{"$f":"lcc[[#This Row],[_2]]","v":""}]
[{"$f":"lcc[[#This Row],[speed]]","v":"constant"},{"$f":"lcc[[#This Row],[rated motor power]]","v":60},{"$f":"lcc[[#This Row],[doe]]","v":"ESFM"},{"$f":"lcc[[#This Row],[max er]]","v":16},{"$f":"lcc[[#This Row],[Column1]]","v":""},{"$f":"lcc[[#This Row],[_1]]","v":""},{"$f":"lcc[[#This Row],[_2]]","v":""}]
[{"$f":"lcc[[#This Row],[speed]]","v":"constant"},{"$f":"lcc[[#This Row],[rated motor power]]","v":60},{"$f":"lcc[[#This Row],[doe]]","v":"IL"},{"$f":"lcc[[#This Row],[max er]]","v":15},{"$f":"lcc[[#This Row],[Column1]]","v":""},{"$f":"lcc[[#This Row],[_1]]","v":""},{"$f":"lcc[[#This Row],[_2]]","v":""}]
[{"$f":"lcc[[#This Row],[speed]]","v":"constant"},{"$f":"lcc[[#This Row],[rated motor power]]","v":60},{"$f":"lcc[[#This Row],[doe]]","v":"RSV"},{"$f":"lcc[[#This Row],[max er]]","v":8},{"$f":"lcc[[#This Row],[Column1]]","v":""},{"$f":"lcc[[#This Row],[_1]]","v":""},{"$f":"lcc[[#This Row],[_2]]","v":""}]
[{"$f":"lcc[[#This Row],[speed]]","v":"constant"},{"$f":"lcc[[#This Row],[rated motor power]]","v":60},{"$f":"lcc[[#This Row],[doe]]","v":"ST"},{"$f":"lcc[[#This Row],[max er]]","v":12},{"$f":"lcc[[#This Row],[Column1]]","v":""},{"$f":"lcc[[#This Row],[_1]]","v":""},{"$f":"lcc[[#This Row],[_2]]","v":""}]
[{"$f":"lcc[[#This Row],[speed]]","v":"constant"},{"$f":"lcc[[#This Row],[rated motor power]]","v":75},{"$f":"lcc[[#This Row],[doe]]","v":"ESCC"},{"$f":"lcc[[#This Row],[max er]]","v":16},{"$f":"lcc[[#This Row],[Column1]]","v":""},{"$f":"lcc[[#This Row],[_1]]","v":""},{"$f":"lcc[[#This Row],[_2]]","v":""}]
[{"$f":"lcc[[#This Row],[speed]]","v":"constant"},{"$f":"lcc[[#This Row],[rated motor power]]","v":75},{"$f":"lcc[[#This Row],[doe]]","v":"ESFM"},{"$f":"lcc[[#This Row],[max er]]","v":13},{"$f":"lcc[[#This Row],[Column1]]","v":""},{"$f":"lcc[[#This Row],[_1]]","v":""},{"$f":"lcc[[#This Row],[_2]]","v":""}]
[{"$f":"lcc[[#This Row],[speed]]","v":"constant"},{"$f":"lcc[[#This Row],[rated motor power]]","v":75},{"$f":"lcc[[#This Row],[doe]]","v":"IL"},{"$f":"lcc[[#This Row],[max er]]","v":16},{"$f":"lcc[[#This Row],[Column1]]","v":""},{"$f":"lcc[[#This Row],[_1]]","v":""},{"$f":"lcc[[#This Row],[_2]]","v":""}]
[{"$f":"lcc[[#This Row],[speed]]","v":"constant"},{"$f":"lcc[[#This Row],[rated motor power]]","v":75},{"$f":"lcc[[#This Row],[doe]]","v":"RSV"},{"$f":"lcc[[#This Row],[max er]]","v":8},{"$f":"lcc[[#This Row],[Column1]]","v":""},{"$f":"lcc[[#This Row],[_1]]","v":""},{"$f":"lcc[[#This Row],[_2]]","v":""}]
[{"$f":"lcc[[#This Row],[speed]]","v":"constant"},{"$f":"lcc[[#This Row],[rated motor power]]","v":75},{"$f":"lcc[[#This Row],[doe]]","v":"ST"},{"$f":"lcc[[#This Row],[max er]]","v":19},{"$f":"lcc[[#This Row],[Column1]]","v":""},{"$f":"lcc[[#This Row],[_1]]","v":""},{"$f":"lcc[[#This Row],[_2]]","v":""}]
[{"$f":"lcc[[#This Row],[speed]]","v":"constant"},{"$f":"lcc[[#This Row],[rated motor power]]","v":100},{"$f":"lcc[[#This Row],[doe]]","v":"ESCC"},{"$f":"lcc[[#This Row],[max er]]","v":10},{"$f":"lcc[[#This Row],[Column1]]","v":""},{"$f":"lcc[[#This Row],[_1]]","v":""},{"$f":"lcc[[#This Row],[_2]]","v":""}]
[{"$f":"lcc[[#This Row],[speed]]","v":"constant"},{"$f":"lcc[[#This Row],[rated motor power]]","v":100},{"$f":"lcc[[#This Row],[doe]]","v":"ESFM"},{"$f":"lcc[[#This Row],[max er]]","v":45},{"$f":"lcc[[#This Row],[Column1]]","v":""},{"$f":"lcc[[#This Row],[_1]]","v":""},{"$f":"lcc[[#This Row],[_2]]","v":""}]
[{"$f":"lcc[[#This Row],[speed]]","v":"constant"},{"$f":"lcc[[#This Row],[rated motor power]]","v":100},{"$f":"lcc[[#This Row],[doe]]","v":"IL"},{"$f":"lcc[[#This Row],[max er]]","v":13},{"$f":"lcc[[#This Row],[Column1]]","v":""},{"$f":"lcc[[#This Row],[_1]]","v":""},{"$f":"lcc[[#This Row],[_2]]","v":""}]
[{"$f":"lcc[[#This Row],[speed]]","v":"constant"},{"$f":"lcc[[#This Row],[rated motor power]]","v":100},{"$f":"lcc[[#This Row],[doe]]","v":"RSV"},{"$f":"lcc[[#This Row],[max er]]","v":8},{"$f":"lcc[[#This Row],[Column1]]","v":""},{"$f":"lcc[[#This Row],[_1]]","v":""},{"$f":"lcc[[#This Row],[_2]]","v":""}]
[{"$f":"lcc[[#This Row],[speed]]","v":"constant"},{"$f":"lcc[[#This Row],[rated motor power]]","v":100},{"$f":"lcc[[#This Row],[doe]]","v":"ST"},{"$f":"lcc[[#This Row],[max er]]","v":"-"},{"$f":"lcc[[#This Row],[Column1]]","v":""},{"$f":"lcc[[#This Row],[_1]]","v":""},{"$f":"lcc[[#This Row],[_2]]","v":""}]
[{"$f":"lcc[[#This Row],[speed]]","v":"constant"},{"$f":"lcc[[#This Row],[rated motor power]]","v":125},{"$f":"lcc[[#This Row],[doe]]","v":"ESCC"},{"$f":"lcc[[#This Row],[max er]]","v":7},{"$f":"lcc[[#This Row],[Column1]]","v":""},{"$f":"lcc[[#This Row],[_1]]","v":""},{"$f":"lcc[[#This Row],[_2]]","v":""}]
[{"$f":"lcc[[#This Row],[speed]]","v":"constant"},{"$f":"lcc[[#This Row],[rated motor power]]","v":125},{"$f":"lcc[[#This Row],[doe]]","v":"ESFM"},{"$f":"lcc[[#This Row],[max er]]","v":8},{"$f":"lcc[[#This Row],[Column1]]","v":""},{"$f":"lcc[[#This Row],[_1]]","v":""},{"$f":"lcc[[#This Row],[_2]]","v":""}]
[{"$f":"lcc[[#This Row],[speed]]","v":"constant"},{"$f":"lcc[[#This Row],[rated motor power]]","v":125},{"$f":"lcc[[#This Row],[doe]]","v":"IL"},{"$f":"lcc[[#This Row],[max er]]","v":12},{"$f":"lcc[[#This Row],[Column1]]","v":""},{"$f":"lcc[[#This Row],[_1]]","v":""},{"$f":"lcc[[#This Row],[_2]]","v":""}]
[{"$f":"lcc[[#This Row],[speed]]","v":"constant"},{"$f":"lcc[[#This Row],[rated motor power]]","v":125},{"$f":"lcc[[#This Row],[doe]]","v":"RSV"},{"$f":"lcc[[#This Row],[max er]]","v":7},{"$f":"lcc[[#This Row],[Column1]]","v":""},{"$f":"lcc[[#This Row],[_1]]","v":""},{"$f":"lcc[[#This Row],[_2]]","v":""}]
[{"$f":"lcc[[#This Row],[speed]]","v":"constant"},{"$f":"lcc[[#This Row],[rated motor power]]","v":125},{"$f":"lcc[[#This Row],[doe]]","v":"ST"},{"$f":"lcc[[#This Row],[max er]]","v":"-"},{"$f":"lcc[[#This Row],[Column1]]","v":""},{"$f":"lcc[[#This Row],[_1]]","v":""},{"$f":"lcc[[#This Row],[_2]]","v":""}]
[{"$f":"lcc[[#This Row],[speed]]","v":"constant"},{"$f":"lcc[[#This Row],[rated motor power]]","v":150},{"$f":"lcc[[#This Row],[doe]]","v":"ESCC"},{"$f":"lcc[[#This Row],[max er]]","v":8},{"$f":"lcc[[#This Row],[Column1]]","v":""},{"$f":"lcc[[#This Row],[_1]]","v":""},{"$f":"lcc[[#This Row],[_2]]","v":""}]
[{"$f":"lcc[[#This Row],[speed]]","v":"constant"},{"$f":"lcc[[#This Row],[rated motor power]]","v":150},{"$f":"lcc[[#This Row],[doe]]","v":"ESFM"},{"$f":"lcc[[#This Row],[max er]]","v":8},{"$f":"lcc[[#This Row],[Column1]]","v":""},{"$f":"lcc[[#This Row],[_1]]","v":""},{"$f":"lcc[[#This Row],[_2]]","v":""}]
[{"$f":"lcc[[#This Row],[speed]]","v":"constant"},{"$f":"lcc[[#This Row],[rated motor power]]","v":150},{"$f":"lcc[[#This Row],[doe]]","v":"IL"},{"$f":"lcc[[#This Row],[max er]]","v":13},{"$f":"lcc[[#This Row],[Column1]]","v":""},{"$f":"lcc[[#This Row],[_1]]","v":""},{"$f":"lcc[[#This Row],[_2]]","v":""}]
[{"$f":"lcc[[#This Row],[speed]]","v":"constant"},{"$f":"lcc[[#This Row],[rated motor power]]","v":150},{"$f":"lcc[[#This Row],[doe]]","v":"RSV"},{"$f":"lcc[[#This Row],[max er]]","v":"-"},{"$f":"lcc[[#This Row],[Column1]]","v":""},{"$f":"lcc[[#This Row],[_1]]","v":""},{"$f":"lcc[[#This Row],[_2]]","v":""}]
[{"$f":"lcc[[#This Row],[speed]]","v":"constant"},{"$f":"lcc[[#This Row],[rated motor power]]","v":150},{"$f":"lcc[[#This Row],[doe]]","v":"ST"},{"$f":"lcc[[#This Row],[max er]]","v":"-"},{"$f":"lcc[[#This Row],[Column1]]","v":""},{"$f":"lcc[[#This Row],[_1]]","v":""},{"$f":"lcc[[#This Row],[_2]]","v":""}]
[{"$f":"lcc[[#This Row],[speed]]","v":"constant"},{"$f":"lcc[[#This Row],[rated motor power]]","v":200},{"$f":"lcc[[#This Row],[doe]]","v":"ESCC"},{"$f":"lcc[[#This Row],[max er]]","v":9},{"$f":"lcc[[#This Row],[Column1]]","v":""},{"$f":"lcc[[#This Row],[_1]]","v":""},{"$f":"lcc[[#This Row],[_2]]","v":""}]
[{"$f":"lcc[[#This Row],[speed]]","v":"constant"},{"$f":"lcc[[#This Row],[rated motor power]]","v":200},{"$f":"lcc[[#This Row],[doe]]","v":"ESFM"},{"$f":"lcc[[#This Row],[max er]]","v":9},{"$f":"lcc[[#This Row],[Column1]]","v":""},{"$f":"lcc[[#This Row],[_1]]","v":""},{"$f":"lcc[[#This Row],[_2]]","v":""}]
[{"$f":"lcc[[#This Row],[speed]]","v":"constant"},{"$f":"lcc[[#This Row],[rated motor power]]","v":200},{"$f":"lcc[[#This Row],[doe]]","v":"IL"},{"$f":"lcc[[#This Row],[max er]]","v":8},{"$f":"lcc[[#This Row],[Column1]]","v":""},{"$f":"lcc[[#This Row],[_1]]","v":""},{"$f":"lcc[[#This Row],[_2]]","v":""}]
[{"$f":"lcc[[#This Row],[speed]]","v":"constant"},{"$f":"lcc[[#This Row],[rated motor power]]","v":200},{"$f":"lcc[[#This Row],[doe]]","v":"RSV"},{"$f":"lcc[[#This Row],[max er]]","v":"-"},{"$f":"lcc[[#This Row],[Column1]]","v":""},{"$f":"lcc[[#This Row],[_1]]","v":""},{"$f":"lcc[[#This Row],[_2]]","v":""}]
[{"$f":"lcc[[#This Row],[speed]]","v":"constant"},{"$f":"lcc[[#This Row],[rated motor power]]","v":200},{"$f":"lcc[[#This Row],[doe]]","v":"ST"},{"$f":"lcc[[#This Row],[max er]]","v":"-"},{"$f":"lcc[[#This Row],[Column1]]","v":""},{"$f":"lcc[[#This Row],[_1]]","v":""},{"$f":"lcc[[#This Row],[_2]]","v":""}]
[{"$f":"lcc[[#This Row],[speed]]","v":"constant"},{"$f":"lcc[[#This Row],[rated motor power]]","v":250},{"$f":"lcc[[#This Row],[doe]]","v":"ESCC"},{"$f":"lcc[[#This Row],[max er]]","v":5},{"$f":"lcc[[#This Row],[Column1]]","v":""},{"$f":"lcc[[#This Row],[_1]]","v":""},{"$f":"lcc[[#This Row],[_2]]","v":""}]
[{"$f":"lcc[[#This Row],[speed]]","v":"constant"},{"$f":"lcc[[#This Row],[rated motor power]]","v":250},{"$f":"lcc[[#This Row],[doe]]","v":"ESFM"},{"$f":"lcc[[#This Row],[max er]]","v":6},{"$f":"lcc[[#This Row],[Column1]]","v":""},{"$f":"lcc[[#This Row],[_1]]","v":""},{"$f":"lcc[[#This Row],[_2]]","v":""}]
[{"$f":"lcc[[#This Row],[speed]]","v":"constant"},{"$f":"lcc[[#This Row],[rated motor power]]","v":250},{"$f":"lcc[[#This Row],[doe]]","v":"IL"},{"$f":"lcc[[#This Row],[max er]]","v":5},{"$f":"lcc[[#This Row],[Column1]]","v":""},{"$f":"lcc[[#This Row],[_1]]","v":""},{"$f":"lcc[[#This Row],[_2]]","v":""}]
[{"$f":"lcc[[#This Row],[speed]]","v":"constant"},{"$f":"lcc[[#This Row],[rated motor power]]","v":250},{"$f":"lcc[[#This Row],[doe]]","v":"RSV"},{"$f":"lcc[[#This Row],[max er]]","v":"-"},{"$f":"lcc[[#This Row],[Column1]]","v":""},{"$f":"lcc[[#This Row],[_1]]","v":""},{"$f":"lcc[[#This Row],[_2]]","v":""}]
[{"$f":"lcc[[#This Row],[speed]]","v":"constant"},{"$f":"lcc[[#This Row],[rated motor power]]","v":250},{"$f":"lcc[[#This Row],[doe]]","v":"ST"},{"$f":"lcc[[#This Row],[max er]]","v":"-"},{"$f":"lcc[[#This Row],[Column1]]","v":""},{"$f":"lcc[[#This Row],[_1]]","v":""},{"$f":"lcc[[#This Row],[_2]]","v":""}]
[{"$f":"lcc[[#This Row],[speed]]","v":"variable"},{"$f":"lcc[[#This Row],[rated motor power]]","v":1},{"$f":"lcc[[#This Row],[doe]]","v":"ESCC"},{"$f":"lcc[[#This Row],[max er]]","v":52},{"$f":"lcc[[#This Row],[Column1]]","v":""},{"$f":"lcc[[#This Row],[_1]]","v":""},{"$f":"lcc[[#This Row],[_2]]","v":""}]
[{"$f":"lcc[[#This Row],[speed]]","v":"variable"},{"$f":"lcc[[#This Row],[rated motor power]]","v":1},{"$f":"lcc[[#This Row],[doe]]","v":"ESFM"},{"$f":"lcc[[#This Row],[max er]]","v":49},{"$f":"lcc[[#This Row],[Column1]]","v":""},{"$f":"lcc[[#This Row],[_1]]","v":""},{"$f":"lcc[[#This Row],[_2]]","v":""}]
[{"$f":"lcc[[#This Row],[speed]]","v":"variable"},{"$f":"lcc[[#This Row],[rated motor power]]","v":1},{"$f":"lcc[[#This Row],[doe]]","v":"IL"},{"$f":"lcc[[#This Row],[max er]]","v":62},{"$f":"lcc[[#This Row],[Column1]]","v":""},{"$f":"lcc[[#This Row],[_1]]","v":""},{"$f":"lcc[[#This Row],[_2]]","v":""}]
[{"$f":"lcc[[#This Row],[speed]]","v":"variable"},{"$f":"lcc[[#This Row],[rated motor power]]","v":1},{"$f":"lcc[[#This Row],[doe]]","v":"RSV"},{"$f":"lcc[[#This Row],[max er]]","v":59},{"$f":"lcc[[#This Row],[Column1]]","v":""},{"$f":"lcc[[#This Row],[_1]]","v":""},{"$f":"lcc[[#This Row],[_2]]","v":""}]
[{"$f":"lcc[[#This Row],[speed]]","v":"variable"},{"$f":"lcc[[#This Row],[rated motor power]]","v":1},{"$f":"lcc[[#This Row],[doe]]","v":"ST"},{"$f":"lcc[[#This Row],[max er]]","v":"-"},{"$f":"lcc[[#This Row],[Column1]]","v":""},{"$f":"lcc[[#This Row],[_1]]","v":""},{"$f":"lcc[[#This Row],[_2]]","v":""}]
[{"$f":"lcc[[#This Row],[speed]]","v":"variable"},{"$f":"lcc[[#This Row],[rated motor power]]","v":1.5},{"$f":"lcc[[#This Row],[doe]]","v":"ESCC"},{"$f":"lcc[[#This Row],[max er]]","v":52},{"$f":"lcc[[#This Row],[Column1]]","v":""},{"$f":"lcc[[#This Row],[_1]]","v":""},{"$f":"lcc[[#This Row],[_2]]","v":""}]
[{"$f":"lcc[[#This Row],[speed]]","v":"variable"},{"$f":"lcc[[#This Row],[rated motor power]]","v":1.5},{"$f":"lcc[[#This Row],[doe]]","v":"ESFM"},{"$f":"lcc[[#This Row],[max er]]","v":48},{"$f":"lcc[[#This Row],[Column1]]","v":""},{"$f":"lcc[[#This Row],[_1]]","v":""},{"$f":"lcc[[#This Row],[_2]]","v":""}]
[{"$f":"lcc[[#This Row],[speed]]","v":"variable"},{"$f":"lcc[[#This Row],[rated motor power]]","v":1.5},{"$f":"lcc[[#This Row],[doe]]","v":"IL"},{"$f":"lcc[[#This Row],[max er]]","v":64},{"$f":"lcc[[#This Row],[Column1]]","v":""},{"$f":"lcc[[#This Row],[_1]]","v":""},{"$f":"lcc[[#This Row],[_2]]","v":""}]
[{"$f":"lcc[[#This Row],[speed]]","v":"variable"},{"$f":"lcc[[#This Row],[rated motor power]]","v":1.5},{"$f":"lcc[[#This Row],[doe]]","v":"RSV"},{"$f":"lcc[[#This Row],[max er]]","v":59},{"$f":"lcc[[#This Row],[Column1]]","v":""},{"$f":"lcc[[#This Row],[_1]]","v":""},{"$f":"lcc[[#This Row],[_2]]","v":""}]
[{"$f":"lcc[[#This Row],[speed]]","v":"variable"},{"$f":"lcc[[#This Row],[rated motor power]]","v":1.5},{"$f":"lcc[[#This Row],[doe]]","v":"ST"},{"$f":"lcc[[#This Row],[max er]]","v":46},{"$f":"lcc[[#This Row],[Column1]]","v":""},{"$f":"lcc[[#This Row],[_1]]","v":""},{"$f":"lcc[[#This Row],[_2]]","v":""}]
[{"$f":"lcc[[#This Row],[speed]]","v":"variable"},{"$f":"lcc[[#This Row],[rated motor power]]","v":2},{"$f":"lcc[[#This Row],[doe]]","v":"ESCC"},{"$f":"lcc[[#This Row],[max er]]","v":57},{"$f":"lcc[[#This Row],[Column1]]","v":""},{"$f":"lcc[[#This Row],[_1]]","v":""},{"$f":"lcc[[#This Row],[_2]]","v":""}]
[{"$f":"lcc[[#This Row],[speed]]","v":"variable"},{"$f":"lcc[[#This Row],[rated motor power]]","v":2},{"$f":"lcc[[#This Row],[doe]]","v":"ESFM"},{"$f":"lcc[[#This Row],[max er]]","v":59},{"$f":"lcc[[#This Row],[Column1]]","v":""},{"$f":"lcc[[#This Row],[_1]]","v":""},{"$f":"lcc[[#This Row],[_2]]","v":""}]
[{"$f":"lcc[[#This Row],[speed]]","v":"variable"},{"$f":"lcc[[#This Row],[rated motor power]]","v":2},{"$f":"lcc[[#This Row],[doe]]","v":"IL"},{"$f":"lcc[[#This Row],[max er]]","v":64},{"$f":"lcc[[#This Row],[Column1]]","v":""},{"$f":"lcc[[#This Row],[_1]]","v":""},{"$f":"lcc[[#This Row],[_2]]","v":""}]
[{"$f":"lcc[[#This Row],[speed]]","v":"variable"},{"$f":"lcc[[#This Row],[rated motor power]]","v":2},{"$f":"lcc[[#This Row],[doe]]","v":"RSV"},{"$f":"lcc[[#This Row],[max er]]","v":62},{"$f":"lcc[[#This Row],[Column1]]","v":""},{"$f":"lcc[[#This Row],[_1]]","v":""},{"$f":"lcc[[#This Row],[_2]]","v":""}]
[{"$f":"lcc[[#This Row],[speed]]","v":"variable"},{"$f":"lcc[[#This Row],[rated motor power]]","v":2},{"$f":"lcc[[#This Row],[doe]]","v":"ST"},{"$f":"lcc[[#This Row],[max er]]","v":46},{"$f":"lcc[[#This Row],[Column1]]","v":""},{"$f":"lcc[[#This Row],[_1]]","v":""},{"$f":"lcc[[#This Row],[_2]]","v":""}]
[{"$f":"lcc[[#This Row],[speed]]","v":"variable"},{"$f":"lcc[[#This Row],[rated motor power]]","v":3},{"$f":"lcc[[#This Row],[doe]]","v":"ESCC"},{"$f":"lcc[[#This Row],[max er]]","v":57},{"$f":"lcc[[#This Row],[Column1]]","v":""},{"$f":"lcc[[#This Row],[_1]]","v":""},{"$f":"lcc[[#This Row],[_2]]","v":""}]
[{"$f":"lcc[[#This Row],[speed]]","v":"variable"},{"$f":"lcc[[#This Row],[rated motor power]]","v":3},{"$f":"lcc[[#This Row],[doe]]","v":"ESFM"},{"$f":"lcc[[#This Row],[max er]]","v":59},{"$f":"lcc[[#This Row],[Column1]]","v":""},{"$f":"lcc[[#This Row],[_1]]","v":""},{"$f":"lcc[[#This Row],[_2]]","v":""}]
[{"$f":"lcc[[#This Row],[speed]]","v":"variable"},{"$f":"lcc[[#This Row],[rated motor power]]","v":3},{"$f":"lcc[[#This Row],[doe]]","v":"IL"},{"$f":"lcc[[#This Row],[max er]]","v":64},{"$f":"lcc[[#This Row],[Column1]]","v":""},{"$f":"lcc[[#This Row],[_1]]","v":""},{"$f":"lcc[[#This Row],[_2]]","v":""}]
[{"$f":"lcc[[#This Row],[speed]]","v":"variable"},{"$f":"lcc[[#This Row],[rated motor power]]","v":3},{"$f":"lcc[[#This Row],[doe]]","v":"RSV"},{"$f":"lcc[[#This Row],[max er]]","v":60},{"$f":"lcc[[#This Row],[Column1]]","v":""},{"$f":"lcc[[#This Row],[_1]]","v":""},{"$f":"lcc[[#This Row],[_2]]","v":""}]
[{"$f":"lcc[[#This Row],[speed]]","v":"variable"},{"$f":"lcc[[#This Row],[rated motor power]]","v":3},{"$f":"lcc[[#This Row],[doe]]","v":"ST"},{"$f":"lcc[[#This Row],[max er]]","v":51},{"$f":"lcc[[#This Row],[Column1]]","v":""},{"$f":"lcc[[#This Row],[_1]]","v":""},{"$f":"lcc[[#This Row],[_2]]","v":""}]
[{"$f":"lcc[[#This Row],[speed]]","v":"variable"},{"$f":"lcc[[#This Row],[rated motor power]]","v":5},{"$f":"lcc[[#This Row],[doe]]","v":"ESCC"},{"$f":"lcc[[#This Row],[max er]]","v":57},{"$f":"lcc[[#This Row],[Column1]]","v":""},{"$f":"lcc[[#This Row],[_1]]","v":""},{"$f":"lcc[[#This Row],[_2]]","v":""}]
[{"$f":"lcc[[#This Row],[speed]]","v":"variable"},{"$f":"lcc[[#This Row],[rated motor power]]","v":5},{"$f":"lcc[[#This Row],[doe]]","v":"ESFM"},{"$f":"lcc[[#This Row],[max er]]","v":62},{"$f":"lcc[[#This Row],[Column1]]","v":""},{"$f":"lcc[[#This Row],[_1]]","v":""},{"$f":"lcc[[#This Row],[_2]]","v":""}]
[{"$f":"lcc[[#This Row],[speed]]","v":"variable"},{"$f":"lcc[[#This Row],[rated motor power]]","v":5},{"$f":"lcc[[#This Row],[doe]]","v":"IL"},{"$f":"lcc[[#This Row],[max er]]","v":58},{"$f":"lcc[[#This Row],[Column1]]","v":""},{"$f":"lcc[[#This Row],[_1]]","v":""},{"$f":"lcc[[#This Row],[_2]]","v":""}]
[{"$f":"lcc[[#This Row],[speed]]","v":"variable"},{"$f":"lcc[[#This Row],[rated motor power]]","v":5},{"$f":"lcc[[#This Row],[doe]]","v":"RSV"},{"$f":"lcc[[#This Row],[max er]]","v":55},{"$f":"lcc[[#This Row],[Column1]]","v":""},{"$f":"lcc[[#This Row],[_1]]","v":""},{"$f":"lcc[[#This Row],[_2]]","v":""}]
[{"$f":"lcc[[#This Row],[speed]]","v":"variable"},{"$f":"lcc[[#This Row],[rated motor power]]","v":5},{"$f":"lcc[[#This Row],[doe]]","v":"ST"},{"$f":"lcc[[#This Row],[max er]]","v":46},{"$f":"lcc[[#This Row],[Column1]]","v":""},{"$f":"lcc[[#This Row],[_1]]","v":""},{"$f":"lcc[[#This Row],[_2]]","v":""}]
[{"$f":"lcc[[#This Row],[speed]]","v":"variable"},{"$f":"lcc[[#This Row],[rated motor power]]","v":7.5},{"$f":"lcc[[#This Row],[doe]]","v":"ESCC"},{"$f":"lcc[[#This Row],[max er]]","v":58},{"$f":"lcc[[#This Row],[Column1]]","v":""},{"$f":"lcc[[#This Row],[_1]]","v":""},{"$f":"lcc[[#This Row],[_2]]","v":""}]
[{"$f":"lcc[[#This Row],[speed]]","v":"variable"},{"$f":"lcc[[#This Row],[rated motor power]]","v":7.5},{"$f":"lcc[[#This Row],[doe]]","v":"ESFM"},{"$f":"lcc[[#This Row],[max er]]","v":62},{"$f":"lcc[[#This Row],[Column1]]","v":""},{"$f":"lcc[[#This Row],[_1]]","v":""},{"$f":"lcc[[#This Row],[_2]]","v":""}]
[{"$f":"lcc[[#This Row],[speed]]","v":"variable"},{"$f":"lcc[[#This Row],[rated motor power]]","v":7.5},{"$f":"lcc[[#This Row],[doe]]","v":"IL"},{"$f":"lcc[[#This Row],[max er]]","v":59},{"$f":"lcc[[#This Row],[Column1]]","v":""},{"$f":"lcc[[#This Row],[_1]]","v":""},{"$f":"lcc[[#This Row],[_2]]","v":""}]
[{"$f":"lcc[[#This Row],[speed]]","v":"variable"},{"$f":"lcc[[#This Row],[rated motor power]]","v":7.5},{"$f":"lcc[[#This Row],[doe]]","v":"RSV"},{"$f":"lcc[[#This Row],[max er]]","v":60},{"$f":"lcc[[#This Row],[Column1]]","v":""},{"$f":"lcc[[#This Row],[_1]]","v":""},{"$f":"lcc[[#This Row],[_2]]","v":""}]
[{"$f":"lcc[[#This Row],[speed]]","v":"variable"},{"$f":"lcc[[#This Row],[rated motor power]]","v":7.5},{"$f":"lcc[[#This Row],[doe]]","v":"ST"},{"$f":"lcc[[#This Row],[max er]]","v":42},{"$f":"lcc[[#This Row],[Column1]]","v":""},{"$f":"lcc[[#This Row],[_1]]","v":""},{"$f":"lcc[[#This Row],[_2]]","v":""}]
[{"$f":"lcc[[#This Row],[speed]]","v":"variable"},{"$f":"lcc[[#This Row],[rated motor power]]","v":10},{"$f":"lcc[[#This Row],[doe]]","v":"ESCC"},{"$f":"lcc[[#This Row],[max er]]","v":56},{"$f":"lcc[[#This Row],[Column1]]","v":""},{"$f":"lcc[[#This Row],[_1]]","v":""},{"$f":"lcc[[#This Row],[_2]]","v":""}]
[{"$f":"lcc[[#This Row],[speed]]","v":"variable"},{"$f":"lcc[[#This Row],[rated motor power]]","v":10},{"$f":"lcc[[#This Row],[doe]]","v":"ESFM"},{"$f":"lcc[[#This Row],[max er]]","v":64},{"$f":"lcc[[#This Row],[Column1]]","v":""},{"$f":"lcc[[#This Row],[_1]]","v":""},{"$f":"lcc[[#This Row],[_2]]","v":""}]
[{"$f":"lcc[[#This Row],[speed]]","v":"variable"},{"$f":"lcc[[#This Row],[rated motor power]]","v":10},{"$f":"lcc[[#This Row],[doe]]","v":"IL"},{"$f":"lcc[[#This Row],[max er]]","v":59},{"$f":"lcc[[#This Row],[Column1]]","v":""},{"$f":"lcc[[#This Row],[_1]]","v":""},{"$f":"lcc[[#This Row],[_2]]","v":""}]
[{"$f":"lcc[[#This Row],[speed]]","v":"variable"},{"$f":"lcc[[#This Row],[rated motor power]]","v":10},{"$f":"lcc[[#This Row],[doe]]","v":"RSV"},{"$f":"lcc[[#This Row],[max er]]","v":56},{"$f":"lcc[[#This Row],[Column1]]","v":""},{"$f":"lcc[[#This Row],[_1]]","v":""},{"$f":"lcc[[#This Row],[_2]]","v":""}]
[{"$f":"lcc[[#This Row],[speed]]","v":"variable"},{"$f":"lcc[[#This Row],[rated motor power]]","v":10},{"$f":"lcc[[#This Row],[doe]]","v":"ST"},{"$f":"lcc[[#This Row],[max er]]","v":48},{"$f":"lcc[[#This Row],[Column1]]","v":""},{"$f":"lcc[[#This Row],[_1]]","v":""},{"$f":"lcc[[#This Row],[_2]]","v":""}]
[{"$f":"lcc[[#This Row],[speed]]","v":"variable"},{"$f":"lcc[[#This Row],[rated motor power]]","v":15},{"$f":"lcc[[#This Row],[doe]]","v":"ESCC"},{"$f":"lcc[[#This Row],[max er]]","v":60},{"$f":"lcc[[#This Row],[Column1]]","v":""},{"$f":"lcc[[#This Row],[_1]]","v":""},{"$f":"lcc[[#This Row],[_2]]","v":""}]
[{"$f":"lcc[[#This Row],[speed]]","v":"variable"},{"$f":"lcc[[#This Row],[rated motor power]]","v":15},{"$f":"lcc[[#This Row],[doe]]","v":"ESFM"},{"$f":"lcc[[#This Row],[max er]]","v":62},{"$f":"lcc[[#This Row],[Column1]]","v":""},{"$f":"lcc[[#This Row],[_1]]","v":""},{"$f":"lcc[[#This Row],[_2]]","v":""}]
[{"$f":"lcc[[#This Row],[speed]]","v":"variable"},{"$f":"lcc[[#This Row],[rated motor power]]","v":15},{"$f":"lcc[[#This Row],[doe]]","v":"IL"},{"$f":"lcc[[#This Row],[max er]]","v":61},{"$f":"lcc[[#This Row],[Column1]]","v":""},{"$f":"lcc[[#This Row],[_1]]","v":""},{"$f":"lcc[[#This Row],[_2]]","v":""}]
[{"$f":"lcc[[#This Row],[speed]]","v":"variable"},{"$f":"lcc[[#This Row],[rated motor power]]","v":15},{"$f":"lcc[[#This Row],[doe]]","v":"RSV"},{"$f":"lcc[[#This Row],[max er]]","v":60},{"$f":"lcc[[#This Row],[Column1]]","v":""},{"$f":"lcc[[#This Row],[_1]]","v":""},{"$f":"lcc[[#This Row],[_2]]","v":""}]
[{"$f":"lcc[[#This Row],[speed]]","v":"variable"},{"$f":"lcc[[#This Row],[rated motor power]]","v":15},{"$f":"lcc[[#This Row],[doe]]","v":"ST"},{"$f":"lcc[[#This Row],[max er]]","v":45},{"$f":"lcc[[#This Row],[Column1]]","v":""},{"$f":"lcc[[#This Row],[_1]]","v":""},{"$f":"lcc[[#This Row],[_2]]","v":""}]
[{"$f":"lcc[[#This Row],[speed]]","v":"variable"},{"$f":"lcc[[#This Row],[rated motor power]]","v":20},{"$f":"lcc[[#This Row],[doe]]","v":"ESCC"},{"$f":"lcc[[#This Row],[max er]]","v":56},{"$f":"lcc[[#This Row],[Column1]]","v":""},{"$f":"lcc[[#This Row],[_1]]","v":""},{"$f":"lcc[[#This Row],[_2]]","v":""}]
[{"$f":"lcc[[#This Row],[speed]]","v":"variable"},{"$f":"lcc[[#This Row],[rated motor power]]","v":20},{"$f":"lcc[[#This Row],[doe]]","v":"ESFM"},{"$f":"lcc[[#This Row],[max er]]","v":57},{"$f":"lcc[[#This Row],[Column1]]","v":""},{"$f":"lcc[[#This Row],[_1]]","v":""},{"$f":"lcc[[#This Row],[_2]]","v":""}]
[{"$f":"lcc[[#This Row],[speed]]","v":"variable"},{"$f":"lcc[[#This Row],[rated motor power]]","v":20},{"$f":"lcc[[#This Row],[doe]]","v":"IL"},{"$f":"lcc[[#This Row],[max er]]","v":59},{"$f":"lcc[[#This Row],[Column1]]","v":""},{"$f":"lcc[[#This Row],[_1]]","v":""},{"$f":"lcc[[#This Row],[_2]]","v":""}]
[{"$f":"lcc[[#This Row],[speed]]","v":"variable"},{"$f":"lcc[[#This Row],[rated motor power]]","v":20},{"$f":"lcc[[#This Row],[doe]]","v":"RSV"},{"$f":"lcc[[#This Row],[max er]]","v":54},{"$f":"lcc[[#This Row],[Column1]]","v":""},{"$f":"lcc[[#This Row],[_1]]","v":""},{"$f":"lcc[[#This Row],[_2]]","v":""}]
[{"$f":"lcc[[#This Row],[speed]]","v":"variable"},{"$f":"lcc[[#This Row],[rated motor power]]","v":20},{"$f":"lcc[[#This Row],[doe]]","v":"ST"},{"$f":"lcc[[#This Row],[max er]]","v":44},{"$f":"lcc[[#This Row],[Column1]]","v":""},{"$f":"lcc[[#This Row],[_1]]","v":""},{"$f":"lcc[[#This Row],[_2]]","v":""}]
[{"$f":"lcc[[#This Row],[speed]]","v":"variable"},{"$f":"lcc[[#This Row],[rated motor power]]","v":25},{"$f":"lcc[[#This Row],[doe]]","v":"ESCC"},{"$f":"lcc[[#This Row],[max er]]","v":58},{"$f":"lcc[[#This Row],[Column1]]","v":""},{"$f":"lcc[[#This Row],[_1]]","v":""},{"$f":"lcc[[#This Row],[_2]]","v":""}]
[{"$f":"lcc[[#This Row],[speed]]","v":"variable"},{"$f":"lcc[[#This Row],[rated motor power]]","v":25},{"$f":"lcc[[#This Row],[doe]]","v":"ESFM"},{"$f":"lcc[[#This Row],[max er]]","v":59},{"$f":"lcc[[#This Row],[Column1]]","v":""},{"$f":"lcc[[#This Row],[_1]]","v":""},{"$f":"lcc[[#This Row],[_2]]","v":""}]
[{"$f":"lcc[[#This Row],[speed]]","v":"variable"},{"$f":"lcc[[#This Row],[rated motor power]]","v":25},{"$f":"lcc[[#This Row],[doe]]","v":"IL"},{"$f":"lcc[[#This Row],[max er]]","v":56},{"$f":"lcc[[#This Row],[Column1]]","v":""},{"$f":"lcc[[#This Row],[_1]]","v":""},{"$f":"lcc[[#This Row],[_2]]","v":""}]
[{"$f":"lcc[[#This Row],[speed]]","v":"variable"},{"$f":"lcc[[#This Row],[rated motor power]]","v":25},{"$f":"lcc[[#This Row],[doe]]","v":"RSV"},{"$f":"lcc[[#This Row],[max er]]","v":56},{"$f":"lcc[[#This Row],[Column1]]","v":""},{"$f":"lcc[[#This Row],[_1]]","v":""},{"$f":"lcc[[#This Row],[_2]]","v":""}]
[{"$f":"lcc[[#This Row],[speed]]","v":"variable"},{"$f":"lcc[[#This Row],[rated motor power]]","v":25},{"$f":"lcc[[#This Row],[doe]]","v":"ST"},{"$f":"lcc[[#This Row],[max er]]","v":45},{"$f":"lcc[[#This Row],[Column1]]","v":""},{"$f":"lcc[[#This Row],[_1]]","v":""},{"$f":"lcc[[#This Row],[_2]]","v":""}]
[{"$f":"lcc[[#This Row],[speed]]","v":"variable"},{"$f":"lcc[[#This Row],[rated motor power]]","v":30},{"$f":"lcc[[#This Row],[doe]]","v":"ESCC"},{"$f":"lcc[[#This Row],[max er]]","v":56},{"$f":"lcc[[#This Row],[Column1]]","v":""},{"$f":"lcc[[#This Row],[_1]]","v":""},{"$f":"lcc[[#This Row],[_2]]","v":""}]
[{"$f":"lcc[[#This Row],[speed]]","v":"variable"},{"$f":"lcc[[#This Row],[rated motor power]]","v":30},{"$f":"lcc[[#This Row],[doe]]","v":"ESFM"},{"$f":"lcc[[#This Row],[max er]]","v":57},{"$f":"lcc[[#This Row],[Column1]]","v":""},{"$f":"lcc[[#This Row],[_1]]","v":""},{"$f":"lcc[[#This Row],[_2]]","v":""}]
[{"$f":"lcc[[#This Row],[speed]]","v":"variable"},{"$f":"lcc[[#This Row],[rated motor power]]","v":30},{"$f":"lcc[[#This Row],[doe]]","v":"IL"},{"$f":"lcc[[#This Row],[max er]]","v":60},{"$f":"lcc[[#This Row],[Column1]]","v":""},{"$f":"lcc[[#This Row],[_1]]","v":""},{"$f":"lcc[[#This Row],[_2]]","v":""}]
[{"$f":"lcc[[#This Row],[speed]]","v":"variable"},{"$f":"lcc[[#This Row],[rated motor power]]","v":30},{"$f":"lcc[[#This Row],[doe]]","v":"RSV"},{"$f":"lcc[[#This Row],[max er]]","v":"-"},{"$f":"lcc[[#This Row],[Column1]]","v":""},{"$f":"lcc[[#This Row],[_1]]","v":""},{"$f":"lcc[[#This Row],[_2]]","v":""}]
[{"$f":"lcc[[#This Row],[speed]]","v":"variable"},{"$f":"lcc[[#This Row],[rated motor power]]","v":30},{"$f":"lcc[[#This Row],[doe]]","v":"ST"},{"$f":"lcc[[#This Row],[max er]]","v":46},{"$f":"lcc[[#This Row],[Column1]]","v":""},{"$f":"lcc[[#This Row],[_1]]","v":""},{"$f":"lcc[[#This Row],[_2]]","v":""}]
[{"$f":"lcc[[#This Row],[speed]]","v":"variable"},{"$f":"lcc[[#This Row],[rated motor power]]","v":40},{"$f":"lcc[[#This Row],[doe]]","v":"ESCC"},{"$f":"lcc[[#This Row],[max er]]","v":59},{"$f":"lcc[[#This Row],[Column1]]","v":""},{"$f":"lcc[[#This Row],[_1]]","v":""},{"$f":"lcc[[#This Row],[_2]]","v":""}]
[{"$f":"lcc[[#This Row],[speed]]","v":"variable"},{"$f":"lcc[[#This Row],[rated motor power]]","v":40},{"$f":"lcc[[#This Row],[doe]]","v":"ESFM"},{"$f":"lcc[[#This Row],[max er]]","v":59},{"$f":"lcc[[#This Row],[Column1]]","v":""},{"$f":"lcc[[#This Row],[_1]]","v":""},{"$f":"lcc[[#This Row],[_2]]","v":""}]
[{"$f":"lcc[[#This Row],[speed]]","v":"variable"},{"$f":"lcc[[#This Row],[rated motor power]]","v":40},{"$f":"lcc[[#This Row],[doe]]","v":"IL"},{"$f":"lcc[[#This Row],[max er]]","v":60},{"$f":"lcc[[#This Row],[Column1]]","v":""},{"$f":"lcc[[#This Row],[_1]]","v":""},{"$f":"lcc[[#This Row],[_2]]","v":""}]
[{"$f":"lcc[[#This Row],[speed]]","v":"variable"},{"$f":"lcc[[#This Row],[rated motor power]]","v":40},{"$f":"lcc[[#This Row],[doe]]","v":"RSV"},{"$f":"lcc[[#This Row],[max er]]","v":55},{"$f":"lcc[[#This Row],[Column1]]","v":""},{"$f":"lcc[[#This Row],[_1]]","v":""},{"$f":"lcc[[#This Row],[_2]]","v":""}]
[{"$f":"lcc[[#This Row],[speed]]","v":"variable"},{"$f":"lcc[[#This Row],[rated motor power]]","v":40},{"$f":"lcc[[#This Row],[doe]]","v":"ST"},{"$f":"lcc[[#This Row],[max er]]","v":47},{"$f":"lcc[[#This Row],[Column1]]","v":""},{"$f":"lcc[[#This Row],[_1]]","v":""},{"$f":"lcc[[#This Row],[_2]]","v":""}]
[{"$f":"lcc[[#This Row],[speed]]","v":"variable"},{"$f":"lcc[[#This Row],[rated motor power]]","v":50},{"$f":"lcc[[#This Row],[doe]]","v":"ESCC"},{"$f":"lcc[[#This Row],[max er]]","v":58},{"$f":"lcc[[#This Row],[Column1]]","v":""},{"$f":"lcc[[#This Row],[_1]]","v":""},{"$f":"lcc[[#This Row],[_2]]","v":""}]
[{"$f":"lcc[[#This Row],[speed]]","v":"variable"},{"$f":"lcc[[#This Row],[rated motor power]]","v":50},{"$f":"lcc[[#This Row],[doe]]","v":"ESFM"},{"$f":"lcc[[#This Row],[max er]]","v":59},{"$f":"lcc[[#This Row],[Column1]]","v":""},{"$f":"lcc[[#This Row],[_1]]","v":""},{"$f":"lcc[[#This Row],[_2]]","v":""}]
[{"$f":"lcc[[#This Row],[speed]]","v":"variable"},{"$f":"lcc[[#This Row],[rated motor power]]","v":50},{"$f":"lcc[[#This Row],[doe]]","v":"IL"},{"$f":"lcc[[#This Row],[max er]]","v":59},{"$f":"lcc[[#This Row],[Column1]]","v":""},{"$f":"lcc[[#This Row],[_1]]","v":""},{"$f":"lcc[[#This Row],[_2]]","v":""}]
[{"$f":"lcc[[#This Row],[speed]]","v":"variable"},{"$f":"lcc[[#This Row],[rated motor power]]","v":50},{"$f":"lcc[[#This Row],[doe]]","v":"RSV"},{"$f":"lcc[[#This Row],[max er]]","v":55},{"$f":"lcc[[#This Row],[Column1]]","v":""},{"$f":"lcc[[#This Row],[_1]]","v":""},{"$f":"lcc[[#This Row],[_2]]","v":""}]
[{"$f":"lcc[[#This Row],[speed]]","v":"variable"},{"$f":"lcc[[#This Row],[rated motor power]]","v":50},{"$f":"lcc[[#This Row],[doe]]","v":"ST"},{"$f":"lcc[[#This Row],[max er]]","v":"-"},{"$f":"lcc[[#This Row],[Column1]]","v":""},{"$f":"lcc[[#This Row],[_1]]","v":""},{"$f":"lcc[[#This Row],[_2]]","v":""}]
[{"$f":"lcc[[#This Row],[speed]]","v":"variable"},{"$f":"lcc[[#This Row],[rated motor power]]","v":60},{"$f":"lcc[[#This Row],[doe]]","v":"ESCC"},{"$f":"lcc[[#This Row],[max er]]","v":55},{"$f":"lcc[[#This Row],[Column1]]","v":""},{"$f":"lcc[[#This Row],[_1]]","v":""},{"$f":"lcc[[#This Row],[_2]]","v":""}]
[{"$f":"lcc[[#This Row],[speed]]","v":"variable"},{"$f":"lcc[[#This Row],[rated motor power]]","v":60},{"$f":"lcc[[#This Row],[doe]]","v":"ESFM"},{"$f":"lcc[[#This Row],[max er]]","v":56},{"$f":"lcc[[#This Row],[Column1]]","v":""},{"$f":"lcc[[#This Row],[_1]]","v":""},{"$f":"lcc[[#This Row],[_2]]","v":""}]
[{"$f":"lcc[[#This Row],[speed]]","v":"variable"},{"$f":"lcc[[#This Row],[rated motor power]]","v":60},{"$f":"lcc[[#This Row],[doe]]","v":"IL"},{"$f":"lcc[[#This Row],[max er]]","v":57},{"$f":"lcc[[#This Row],[Column1]]","v":""},{"$f":"lcc[[#This Row],[_1]]","v":""},{"$f":"lcc[[#This Row],[_2]]","v":""}]
[{"$f":"lcc[[#This Row],[speed]]","v":"variable"},{"$f":"lcc[[#This Row],[rated motor power]]","v":60},{"$f":"lcc[[#This Row],[doe]]","v":"RSV"},{"$f":"lcc[[#This Row],[max er]]","v":"-"},{"$f":"lcc[[#This Row],[Column1]]","v":""},{"$f":"lcc[[#This Row],[_1]]","v":""},{"$f":"lcc[[#This Row],[_2]]","v":""}]
[{"$f":"lcc[[#This Row],[speed]]","v":"variable"},{"$f":"lcc[[#This Row],[rated motor power]]","v":60},{"$f":"lcc[[#This Row],[doe]]","v":"ST"},{"$f":"lcc[[#This Row],[max er]]","v":"-"},{"$f":"lcc[[#This Row],[Column1]]","v":""},{"$f":"lcc[[#This Row],[_1]]","v":""},{"$f":"lcc[[#This Row],[_2]]","v":""}]
[{"$f":"lcc[[#This Row],[speed]]","v":"variable"},{"$f":"lcc[[#This Row],[rated motor power]]","v":75},{"$f":"lcc[[#This Row],[doe]]","v":"ESCC"},{"$f":"lcc[[#This Row],[max er]]","v":55},{"$f":"lcc[[#This Row],[Column1]]","v":""},{"$f":"lcc[[#This Row],[_1]]","v":""},{"$f":"lcc[[#This Row],[_2]]","v":""}]
[{"$f":"lcc[[#This Row],[speed]]","v":"variable"},{"$f":"lcc[[#This Row],[rated motor power]]","v":75},{"$f":"lcc[[#This Row],[doe]]","v":"ESFM"},{"$f":"lcc[[#This Row],[max er]]","v":55},{"$f":"lcc[[#This Row],[Column1]]","v":""},{"$f":"lcc[[#This Row],[_1]]","v":""},{"$f":"lcc[[#This Row],[_2]]","v":""}]
[{"$f":"lcc[[#This Row],[speed]]","v":"variable"},{"$f":"lcc[[#This Row],[rated motor power]]","v":75},{"$f":"lcc[[#This Row],[doe]]","v":"IL"},{"$f":"lcc[[#This Row],[max er]]","v":57},{"$f":"lcc[[#This Row],[Column1]]","v":""},{"$f":"lcc[[#This Row],[_1]]","v":""},{"$f":"lcc[[#This Row],[_2]]","v":""}]
[{"$f":"lcc[[#This Row],[speed]]","v":"variable"},{"$f":"lcc[[#This Row],[rated motor power]]","v":75},{"$f":"lcc[[#This Row],[doe]]","v":"RSV"},{"$f":"lcc[[#This Row],[max er]]","v":41},{"$f":"lcc[[#This Row],[Column1]]","v":""},{"$f":"lcc[[#This Row],[_1]]","v":""},{"$f":"lcc[[#This Row],[_2]]","v":""}]
[{"$f":"lcc[[#This Row],[speed]]","v":"variable"},{"$f":"lcc[[#This Row],[rated motor power]]","v":75},{"$f":"lcc[[#This Row],[doe]]","v":"ST"},{"$f":"lcc[[#This Row],[max er]]","v":"-"},{"$f":"lcc[[#This Row],[Column1]]","v":""},{"$f":"lcc[[#This Row],[_1]]","v":""},{"$f":"lcc[[#This Row],[_2]]","v":""}]
[{"$f":"lcc[[#This Row],[speed]]","v":"variable"},{"$f":"lcc[[#This Row],[rated motor power]]","v":100},{"$f":"lcc[[#This Row],[doe]]","v":"ESCC"},{"$f":"lcc[[#This Row],[max er]]","v":54},{"$f":"lcc[[#This Row],[Column1]]","v":""},{"$f":"lcc[[#This Row],[_1]]","v":""},{"$f":"lcc[[#This Row],[_2]]","v":""}]
[{"$f":"lcc[[#This Row],[speed]]","v":"variable"},{"$f":"lcc[[#This Row],[rated motor power]]","v":100},{"$f":"lcc[[#This Row],[doe]]","v":"ESFM"},{"$f":"lcc[[#This Row],[max er]]","v":54},{"$f":"lcc[[#This Row],[Column1]]","v":""},{"$f":"lcc[[#This Row],[_1]]","v":""},{"$f":"lcc[[#This Row],[_2]]","v":""}]
[{"$f":"lcc[[#This Row],[speed]]","v":"variable"},{"$f":"lcc[[#This Row],[rated motor power]]","v":100},{"$f":"lcc[[#This Row],[doe]]","v":"IL"},{"$f":"lcc[[#This Row],[max er]]","v":56},{"$f":"lcc[[#This Row],[Column1]]","v":""},{"$f":"lcc[[#This Row],[_1]]","v":""},{"$f":"lcc[[#This Row],[_2]]","v":""}]
[{"$f":"lcc[[#This Row],[speed]]","v":"variable"},{"$f":"lcc[[#This Row],[rated motor power]]","v":100},{"$f":"lcc[[#This Row],[doe]]","v":"RSV"},{"$f":"lcc[[#This Row],[max er]]","v":42},{"$f":"lcc[[#This Row],[Column1]]","v":""},{"$f":"lcc[[#This Row],[_1]]","v":""},{"$f":"lcc[[#This Row],[_2]]","v":""}]
[{"$f":"lcc[[#This Row],[speed]]","v":"variable"},{"$f":"lcc[[#This Row],[rated motor power]]","v":100},{"$f":"lcc[[#This Row],[doe]]","v":"ST"},{"$f":"lcc[[#This Row],[max er]]","v":"-"},{"$f":"lcc[[#This Row],[Column1]]","v":""},{"$f":"lcc[[#This Row],[_1]]","v":""},{"$f":"lcc[[#This Row],[_2]]","v":""}]
[{"$f":"lcc[[#This Row],[speed]]","v":"variable"},{"$f":"lcc[[#This Row],[rated motor power]]","v":125},{"$f":"lcc[[#This Row],[doe]]","v":"ESCC"},{"$f":"lcc[[#This Row],[max er]]","v":54},{"$f":"lcc[[#This Row],[Column1]]","v":""},{"$f":"lcc[[#This Row],[_1]]","v":""},{"$f":"lcc[[#This Row],[_2]]","v":""}]
[{"$f":"lcc[[#This Row],[speed]]","v":"variable"},{"$f":"lcc[[#This Row],[rated motor power]]","v":125},{"$f":"lcc[[#This Row],[doe]]","v":"ESFM"},{"$f":"lcc[[#This Row],[max er]]","v":54},{"$f":"lcc[[#This Row],[Column1]]","v":""},{"$f":"lcc[[#This Row],[_1]]","v":""},{"$f":"lcc[[#This Row],[_2]]","v":""}]
[{"$f":"lcc[[#This Row],[speed]]","v":"variable"},{"$f":"lcc[[#This Row],[rated motor power]]","v":125},{"$f":"lcc[[#This Row],[doe]]","v":"IL"},{"$f":"lcc[[#This Row],[max er]]","v":56},{"$f":"lcc[[#This Row],[Column1]]","v":""},{"$f":"lcc[[#This Row],[_1]]","v":""},{"$f":"lcc[[#This Row],[_2]]","v":""}]
[{"$f":"lcc[[#This Row],[speed]]","v":"variable"},{"$f":"lcc[[#This Row],[rated motor power]]","v":125},{"$f":"lcc[[#This Row],[doe]]","v":"RSV"},{"$f":"lcc[[#This Row],[max er]]","v":"-"},{"$f":"lcc[[#This Row],[Column1]]","v":""},{"$f":"lcc[[#This Row],[_1]]","v":""},{"$f":"lcc[[#This Row],[_2]]","v":""}]
[{"$f":"lcc[[#This Row],[speed]]","v":"variable"},{"$f":"lcc[[#This Row],[rated motor power]]","v":125},{"$f":"lcc[[#This Row],[doe]]","v":"ST"},{"$f":"lcc[[#This Row],[max er]]","v":"-"},{"$f":"lcc[[#This Row],[Column1]]","v":""},{"$f":"lcc[[#This Row],[_1]]","v":""},{"$f":"lcc[[#This Row],[_2]]","v":""}]
[{"$f":"lcc[[#This Row],[speed]]","v":"variable"},{"$f":"lcc[[#This Row],[rated motor power]]","v":150},{"$f":"lcc[[#This Row],[doe]]","v":"ESCC"},{"$f":"lcc[[#This Row],[max er]]","v":53},{"$f":"lcc[[#This Row],[Column1]]","v":""},{"$f":"lcc[[#This Row],[_1]]","v":""},{"$f":"lcc[[#This Row],[_2]]","v":""}]
[{"$f":"lcc[[#This Row],[speed]]","v":"variable"},{"$f":"lcc[[#This Row],[rated motor power]]","v":150},{"$f":"lcc[[#This Row],[doe]]","v":"ESFM"},{"$f":"lcc[[#This Row],[max er]]","v":54},{"$f":"lcc[[#This Row],[Column1]]","v":""},{"$f":"lcc[[#This Row],[_1]]","v":""},{"$f":"lcc[[#This Row],[_2]]","v":""}]
[{"$f":"lcc[[#This Row],[speed]]","v":"variable"},{"$f":"lcc[[#This Row],[rated motor power]]","v":150},{"$f":"lcc[[#This Row],[doe]]","v":"IL"},{"$f":"lcc[[#This Row],[max er]]","v":56},{"$f":"lcc[[#This Row],[Column1]]","v":""},{"$f":"lcc[[#This Row],[_1]]","v":""},{"$f":"lcc[[#This Row],[_2]]","v":""}]
[{"$f":"lcc[[#This Row],[speed]]","v":"variable"},{"$f":"lcc[[#This Row],[rated motor power]]","v":150},{"$f":"lcc[[#This Row],[doe]]","v":"RSV"},{"$f":"lcc[[#This Row],[max er]]","v":"-"},{"$f":"lcc[[#This Row],[Column1]]","v":""},{"$f":"lcc[[#This Row],[_1]]","v":""},{"$f":"lcc[[#This Row],[_2]]","v":""}]
[{"$f":"lcc[[#This Row],[speed]]","v":"variable"},{"$f":"lcc[[#This Row],[rated motor power]]","v":150},{"$f":"lcc[[#This Row],[doe]]","v":"ST"},{"$f":"lcc[[#This Row],[max er]]","v":"-"},{"$f":"lcc[[#This Row],[Column1]]","v":""},{"$f":"lcc[[#This Row],[_1]]","v":""},{"$f":"lcc[[#This Row],[_2]]","v":""}]
[{"$f":"lcc[[#This Row],[speed]]","v":"variable"},{"$f":"lcc[[#This Row],[rated motor power]]","v":200},{"$f":"lcc[[#This Row],[doe]]","v":"ESCC"},{"$f":"lcc[[#This Row],[max er]]","v":56},{"$f":"lcc[[#This Row],[Column1]]","v":""},{"$f":"lcc[[#This Row],[_1]]","v":""},{"$f":"lcc[[#This Row],[_2]]","v":""}]
[{"$f":"lcc[[#This Row],[speed]]","v":"variable"},{"$f":"lcc[[#This Row],[rated motor power]]","v":200},{"$f":"lcc[[#This Row],[doe]]","v":"ESFM"},{"$f":"lcc[[#This Row],[max er]]","v":56},{"$f":"lcc[[#This Row],[Column1]]","v":""},{"$f":"lcc[[#This Row],[_1]]","v":""},{"$f":"lcc[[#This Row],[_2]]","v":""}]
[{"$f":"lcc[[#This Row],[speed]]","v":"variable"},{"$f":"lcc[[#This Row],[rated motor power]]","v":200},{"$f":"lcc[[#This Row],[doe]]","v":"IL"},{"$f":"lcc[[#This Row],[max er]]","v":54},{"$f":"lcc[[#This Row],[Column1]]","v":""},{"$f":"lcc[[#This Row],[_1]]","v":""},{"$f":"lcc[[#This Row],[_2]]","v":""}]
[{"$f":"lcc[[#This Row],[speed]]","v":"variable"},{"$f":"lcc[[#This Row],[rated motor power]]","v":200},{"$f":"lcc[[#This Row],[doe]]","v":"RSV"},{"$f":"lcc[[#This Row],[max er]]","v":"-"},{"$f":"lcc[[#This Row],[Column1]]","v":""},{"$f":"lcc[[#This Row],[_1]]","v":""},{"$f":"lcc[[#This Row],[_2]]","v":""}]
[{"$f":"lcc[[#This Row],[speed]]","v":"variable"},{"$f":"lcc[[#This Row],[rated motor power]]","v":200},{"$f":"lcc[[#This Row],[doe]]","v":"ST"},{"$f":"lcc[[#This Row],[max er]]","v":"-"},{"$f":"lcc[[#This Row],[Column1]]","v":""},{"$f":"lcc[[#This Row],[_1]]","v":""},{"$f":"lcc[[#This Row],[_2]]","v":""}]
[{"$f":"lcc[[#This Row],[speed]]","v":"variable"},{"$f":"lcc[[#This Row],[rated motor power]]","v":250},{"$f":"lcc[[#This Row],[doe]]","v":"ESCC"},{"$f":"lcc[[#This Row],[max er]]","v":"-"},{"$f":"lcc[[#This Row],[Column1]]","v":""},{"$f":"lcc[[#This Row],[_1]]","v":""},{"$f":"lcc[[#This Row],[_2]]","v":""}]
[{"$f":"lcc[[#This Row],[speed]]","v":"variable"},{"$f":"lcc[[#This Row],[rated motor power]]","v":250},{"$f":"lcc[[#This Row],[doe]]","v":"ESFM"},{"$f":"lcc[[#This Row],[max er]]","v":"-"},{"$f":"lcc[[#This Row],[Column1]]","v":""},{"$f":"lcc[[#This Row],[_1]]","v":""},{"$f":"lcc[[#This Row],[_2]]","v":""}]
[{"$f":"lcc[[#This Row],[speed]]","v":"variable"},{"$f":"lcc[[#This Row],[rated motor power]]","v":250},{"$f":"lcc[[#This Row],[doe]]","v":"IL"},{"$f":"lcc[[#This Row],[max er]]","v":53},{"$f":"lcc[[#This Row],[Column1]]","v":""},{"$f":"lcc[[#This Row],[_1]]","v":""},{"$f":"lcc[[#This Row],[_2]]","v":""}]
[{"$f":"lcc[[#This Row],[speed]]","v":"variable"},{"$f":"lcc[[#This Row],[rated motor power]]","v":250},{"$f":"lcc[[#This Row],[doe]]","v":"RSV"},{"$f":"lcc[[#This Row],[max er]]","v":"-"},{"$f":"lcc[[#This Row],[Column1]]","v":""},{"$f":"lcc[[#This Row],[_1]]","v":""},{"$f":"lcc[[#This Row],[_2]]","v":""}]
[{"$f":"lcc[[#This Row],[speed]]","v":"variable"},{"$f":"lcc[[#This Row],[rated motor power]]","v":250},{"$f":"lcc[[#This Row],[doe]]","v":"ST"},{"$f":"lcc[[#This Row],[max er]]","v":"-"},{"$f":"lcc[[#This Row],[Column1]]","v":""},{"$f":"lcc[[#This Row],[_1]]","v":""},{"$f":"lcc[[#This Row],[_2]]","v":""}]
[{"$f":"lcc[[#This Row],[speed]]","v":"configuration"},{"$f":"lcc[[#This Row],[rated motor power]]","v":0},{"$f":"lcc[[#This Row],[doe]]","v":"flow"},{"$f":"lcc[[#This Row],[max er]]","v":"head"},{"$f":"lcc[[#This Row],[Column1]]","v":"min er"},{"$f":"lcc[[#This Row],[_1]]","v":"avg er"},{"$f":"lcc[[#This Row],[_2]]","v":"max er"}]
["constant","ESCC",{"$f":"lcc[[#This Row],[doe]]","v":"0-50"},{"$f":"lcc[[#This Row],[max er]]","v":"0-50"},{"$f":"lcc[[#This Row],[Column1]]","v":"-"},{"$f":"lcc[[#This Row],[_1]]","v":"-"},{"$f":"lcc[[#This Row],[_2]]","v":"-"}]
["constant","ESCC",{"$f":"lcc[[#This Row],[doe]]","v":"0-50"},{"$f":"lcc[[#This Row],[max er]]","v":"50-100"},{"$f":"lcc[[#This Row],[Column1]]","v":1},{"$f":"lcc[[#This Row],[_1]]","v":7},{"$f":"lcc[[#This Row],[_2]]","v":14}]
["constant","ESCC",{"$f":"lcc[[#This Row],[doe]]","v":"0-50"},{"$f":"lcc[[#This Row],[max er]]","v":"100+"},{"$f":"lcc[[#This Row],[Column1]]","v":4},{"$f":"lcc[[#This Row],[_1]]","v":14},{"$f":"lcc[[#This Row],[_2]]","v":24}]
["constant","ESCC",{"$f":"lcc[[#This Row],[doe]]","v":"50-100"},{"$f":"lcc[[#This Row],[max er]]","v":"0-50"},{"$f":"lcc[[#This Row],[Column1]]","v":1},{"$f":"lcc[[#This Row],[_1]]","v":7},{"$f":"lcc[[#This Row],[_2]]","v":17}]
["constant","ESCC",{"$f":"lcc[[#This Row],[doe]]","v":"50-100"},{"$f":"lcc[[#This Row],[max er]]","v":"50-100"},{"$f":"lcc[[#This Row],[Column1]]","v":1},{"$f":"lcc[[#This Row],[_1]]","v":8},{"$f":"lcc[[#This Row],[_2]]","v":18}]
["constant","ESCC",{"$f":"lcc[[#This Row],[doe]]","v":"50-100"},{"$f":"lcc[[#This Row],[max er]]","v":"100+"},{"$f":"lcc[[#This Row],[Column1]]","v":2},{"$f":"lcc[[#This Row],[_1]]","v":12},{"$f":"lcc[[#This Row],[_2]]","v":26}]
["constant","ESCC",{"$f":"lcc[[#This Row],[doe]]","v":"100-150"},{"$f":"lcc[[#This Row],[max er]]","v":"0-50"},{"$f":"lcc[[#This Row],[Column1]]","v":0},{"$f":"lcc[[#This Row],[_1]]","v":6},{"$f":"lcc[[#This Row],[_2]]","v":15}]
["constant","ESCC",{"$f":"lcc[[#This Row],[doe]]","v":"100-150"},{"$f":"lcc[[#This Row],[max er]]","v":"50-100"},{"$f":"lcc[[#This Row],[Column1]]","v":1},{"$f":"lcc[[#This Row],[_1]]","v":10},{"$f":"lcc[[#This Row],[_2]]","v":17}]
["constant","ESCC",{"$f":"lcc[[#This Row],[doe]]","v":"100-150"},{"$f":"lcc[[#This Row],[max er]]","v":"100+"},{"$f":"lcc[[#This Row],[Column1]]","v":-5},{"$f":"lcc[[#This Row],[_1]]","v":12},{"$f":"lcc[[#This Row],[_2]]","v":25}]
["constant","ESCC",{"$f":"lcc[[#This Row],[doe]]","v":"150-200"},{"$f":"lcc[[#This Row],[max er]]","v":"0-50"},{"$f":"lcc[[#This Row],[Column1]]","v":0},{"$f":"lcc[[#This Row],[_1]]","v":7},{"$f":"lcc[[#This Row],[_2]]","v":13}]
["constant","ESCC",{"$f":"lcc[[#This Row],[doe]]","v":"150-200"},{"$f":"lcc[[#This Row],[max er]]","v":"50-100"},{"$f":"lcc[[#This Row],[Column1]]","v":2},{"$f":"lcc[[#This Row],[_1]]","v":6},{"$f":"lcc[[#This Row],[_2]]","v":13}]
["constant","ESCC",{"$f":"lcc[[#This Row],[doe]]","v":"150-200"},{"$f":"lcc[[#This Row],[max er]]","v":"100+"},{"$f":"lcc[[#This Row],[Column1]]","v":0},{"$f":"lcc[[#This Row],[_1]]","v":11},{"$f":"lcc[[#This Row],[_2]]","v":21}]
["constant","ESCC",{"$f":"lcc[[#This Row],[doe]]","v":"200-300"},{"$f":"lcc[[#This Row],[max er]]","v":"0-50"},{"$f":"lcc[[#This Row],[Column1]]","v":2},{"$f":"lcc[[#This Row],[_1]]","v":5},{"$f":"lcc[[#This Row],[_2]]","v":8}]
["constant","ESCC",{"$f":"lcc[[#This Row],[doe]]","v":"200-300"},{"$f":"lcc[[#This Row],[max er]]","v":"50-100"},{"$f":"lcc[[#This Row],[Column1]]","v":0},{"$f":"lcc[[#This Row],[_1]]","v":9},{"$f":"lcc[[#This Row],[_2]]","v":14}]
["constant","ESCC",{"$f":"lcc[[#This Row],[doe]]","v":"200-300"},{"$f":"lcc[[#This Row],[max er]]","v":"100+"},{"$f":"lcc[[#This Row],[Column1]]","v":1},{"$f":"lcc[[#This Row],[_1]]","v":10},{"$f":"lcc[[#This Row],[_2]]","v":20}]
["constant","ESCC",{"$f":"lcc[[#This Row],[doe]]","v":"300-800"},{"$f":"lcc[[#This Row],[max er]]","v":"0-50"},{"$f":"lcc[[#This Row],[Column1]]","v":0},{"$f":"lcc[[#This Row],[_1]]","v":6},{"$f":"lcc[[#This Row],[_2]]","v":10}]
["constant","ESCC",{"$f":"lcc[[#This Row],[doe]]","v":"300-800"},{"$f":"lcc[[#This Row],[max er]]","v":"50-100"},{"$f":"lcc[[#This Row],[Column1]]","v":1},{"$f":"lcc[[#This Row],[_1]]","v":6},{"$f":"lcc[[#This Row],[_2]]","v":10}]
["constant","ESCC",{"$f":"lcc[[#This Row],[doe]]","v":"300-800"},{"$f":"lcc[[#This Row],[max er]]","v":"100+"},{"$f":"lcc[[#This Row],[Column1]]","v":0},{"$f":"lcc[[#This Row],[_1]]","v":7},{"$f":"lcc[[#This Row],[_2]]","v":18}]
["constant","ESCC",{"$f":"lcc[[#This Row],[doe]]","v":"800+"},{"$f":"lcc[[#This Row],[max er]]","v":"0-50"},{"$f":"lcc[[#This Row],[Column1]]","v":"-"},{"$f":"lcc[[#This Row],[_1]]","v":"-"},{"$f":"lcc[[#This Row],[_2]]","v":"-"}]
["constant","ESCC",{"$f":"lcc[[#This Row],[doe]]","v":"800+"},{"$f":"lcc[[#This Row],[max er]]","v":"50-100"},{"$f":"lcc[[#This Row],[Column1]]","v":2},{"$f":"lcc[[#This Row],[_1]]","v":5},{"$f":"lcc[[#This Row],[_2]]","v":11}]
["constant","ESCC",{"$f":"lcc[[#This Row],[doe]]","v":"800+"},{"$f":"lcc[[#This Row],[max er]]","v":"100+"},{"$f":"lcc[[#This Row],[Column1]]","v":0},{"$f":"lcc[[#This Row],[_1]]","v":4},{"$f":"lcc[[#This Row],[_2]]","v":12}]
["constant","ESFM",{"$f":"lcc[[#This Row],[doe]]","v":"0-50"},{"$f":"lcc[[#This Row],[max er]]","v":"0-50"},{"$f":"lcc[[#This Row],[Column1]]","v":"-"},{"$f":"lcc[[#This Row],[_1]]","v":"-"},{"$f":"lcc[[#This Row],[_2]]","v":"-"}]
["constant","ESFM",{"$f":"lcc[[#This Row],[doe]]","v":"0-50"},{"$f":"lcc[[#This Row],[max er]]","v":"50-100"},{"$f":"lcc[[#This Row],[Column1]]","v":2},{"$f":"lcc[[#This Row],[_1]]","v":9},{"$f":"lcc[[#This Row],[_2]]","v":15}]
["constant","ESFM",{"$f":"lcc[[#This Row],[doe]]","v":"0-50"},{"$f":"lcc[[#This Row],[max er]]","v":"100+"},{"$f":"lcc[[#This Row],[Column1]]","v":6},{"$f":"lcc[[#This Row],[_1]]","v":16},{"$f":"lcc[[#This Row],[_2]]","v":21}]
["constant","ESFM",{"$f":"lcc[[#This Row],[doe]]","v":"50-100"},{"$f":"lcc[[#This Row],[max er]]","v":"0-50"},{"$f":"lcc[[#This Row],[Column1]]","v":2},{"$f":"lcc[[#This Row],[_1]]","v":8},{"$f":"lcc[[#This Row],[_2]]","v":22}]
["constant","ESFM",{"$f":"lcc[[#This Row],[doe]]","v":"50-100"},{"$f":"lcc[[#This Row],[max er]]","v":"50-100"},{"$f":"lcc[[#This Row],[Column1]]","v":1},{"$f":"lcc[[#This Row],[_1]]","v":11},{"$f":"lcc[[#This Row],[_2]]","v":29}]
["constant","ESFM",{"$f":"lcc[[#This Row],[doe]]","v":"50-100"},{"$f":"lcc[[#This Row],[max er]]","v":"100+"},{"$f":"lcc[[#This Row],[Column1]]","v":1},{"$f":"lcc[[#This Row],[_1]]","v":12},{"$f":"lcc[[#This Row],[_2]]","v":19}]
["constant","ESFM",{"$f":"lcc[[#This Row],[doe]]","v":"100-150"},{"$f":"lcc[[#This Row],[max er]]","v":"0-50"},{"$f":"lcc[[#This Row],[Column1]]","v":0},{"$f":"lcc[[#This Row],[_1]]","v":8},{"$f":"lcc[[#This Row],[_2]]","v":14}]
["constant","ESFM",{"$f":"lcc[[#This Row],[doe]]","v":"100-150"},{"$f":"lcc[[#This Row],[max er]]","v":"50-100"},{"$f":"lcc[[#This Row],[Column1]]","v":1},{"$f":"lcc[[#This Row],[_1]]","v":10},{"$f":"lcc[[#This Row],[_2]]","v":17}]
["constant","ESFM",{"$f":"lcc[[#This Row],[doe]]","v":"100-150"},{"$f":"lcc[[#This Row],[max er]]","v":"100+"},{"$f":"lcc[[#This Row],[Column1]]","v":1},{"$f":"lcc[[#This Row],[_1]]","v":11},{"$f":"lcc[[#This Row],[_2]]","v":25}]
["constant","ESFM",{"$f":"lcc[[#This Row],[doe]]","v":"150-200"},{"$f":"lcc[[#This Row],[max er]]","v":"0-50"},{"$f":"lcc[[#This Row],[Column1]]","v":1},{"$f":"lcc[[#This Row],[_1]]","v":8},{"$f":"lcc[[#This Row],[_2]]","v":16}]
["constant","ESFM",{"$f":"lcc[[#This Row],[doe]]","v":"150-200"},{"$f":"lcc[[#This Row],[max er]]","v":"50-100"},{"$f":"lcc[[#This Row],[Column1]]","v":1},{"$f":"lcc[[#This Row],[_1]]","v":6},{"$f":"lcc[[#This Row],[_2]]","v":14}]
["constant","ESFM",{"$f":"lcc[[#This Row],[doe]]","v":"150-200"},{"$f":"lcc[[#This Row],[max er]]","v":"100+"},{"$f":"lcc[[#This Row],[Column1]]","v":0},{"$f":"lcc[[#This Row],[_1]]","v":10},{"$f":"lcc[[#This Row],[_2]]","v":20}]
["constant","ESFM",{"$f":"lcc[[#This Row],[doe]]","v":"200-300"},{"$f":"lcc[[#This Row],[max er]]","v":"0-50"},{"$f":"lcc[[#This Row],[Column1]]","v":2},{"$f":"lcc[[#This Row],[_1]]","v":6},{"$f":"lcc[[#This Row],[_2]]","v":11}]
["constant","ESFM",{"$f":"lcc[[#This Row],[doe]]","v":"200-300"},{"$f":"lcc[[#This Row],[max er]]","v":"50-100"},{"$f":"lcc[[#This Row],[Column1]]","v":1},{"$f":"lcc[[#This Row],[_1]]","v":7},{"$f":"lcc[[#This Row],[_2]]","v":15}]
["constant","ESFM",{"$f":"lcc[[#This Row],[doe]]","v":"200-300"},{"$f":"lcc[[#This Row],[max er]]","v":"100+"},{"$f":"lcc[[#This Row],[Column1]]","v":2},{"$f":"lcc[[#This Row],[_1]]","v":10},{"$f":"lcc[[#This Row],[_2]]","v":20}]
["constant","ESFM",{"$f":"lcc[[#This Row],[doe]]","v":"300-800"},{"$f":"lcc[[#This Row],[max er]]","v":"0-50"},{"$f":"lcc[[#This Row],[Column1]]","v":1},{"$f":"lcc[[#This Row],[_1]]","v":6},{"$f":"lcc[[#This Row],[_2]]","v":11}]
["constant","ESFM",{"$f":"lcc[[#This Row],[doe]]","v":"300-800"},{"$f":"lcc[[#This Row],[max er]]","v":"50-100"},{"$f":"lcc[[#This Row],[Column1]]","v":2},{"$f":"lcc[[#This Row],[_1]]","v":5},{"$f":"lcc[[#This Row],[_2]]","v":11}]
["constant","ESFM",{"$f":"lcc[[#This Row],[doe]]","v":"300-800"},{"$f":"lcc[[#This Row],[max er]]","v":"100+"},{"$f":"lcc[[#This Row],[Column1]]","v":0},{"$f":"lcc[[#This Row],[_1]]","v":7},{"$f":"lcc[[#This Row],[_2]]","v":19}]
["constant","ESFM",{"$f":"lcc[[#This Row],[doe]]","v":"800+"},{"$f":"lcc[[#This Row],[max er]]","v":"0-50"},{"$f":"lcc[[#This Row],[Column1]]","v":"-"},{"$f":"lcc[[#This Row],[_1]]","v":"-"},{"$f":"lcc[[#This Row],[_2]]","v":"-"}]
["constant","ESFM",{"$f":"lcc[[#This Row],[doe]]","v":"800+"},{"$f":"lcc[[#This Row],[max er]]","v":"50-100"},{"$f":"lcc[[#This Row],[Column1]]","v":0},{"$f":"lcc[[#This Row],[_1]]","v":4},{"$f":"lcc[[#This Row],[_2]]","v":11}]
["constant","ESFM",{"$f":"lcc[[#This Row],[doe]]","v":"800+"},{"$f":"lcc[[#This Row],[max er]]","v":"100+"},{"$f":"lcc[[#This Row],[Column1]]","v":0},{"$f":"lcc[[#This Row],[_1]]","v":4},{"$f":"lcc[[#This Row],[_2]]","v":13}]
["constant","IL",{"$f":"lcc[[#This Row],[doe]]","v":"0-50"},{"$f":"lcc[[#This Row],[max er]]","v":"0-50"},{"$f":"lcc[[#This Row],[Column1]]","v":"-"},{"$f":"lcc[[#This Row],[_1]]","v":"-"},{"$f":"lcc[[#This Row],[_2]]","v":"-"}]
["constant","IL",{"$f":"lcc[[#This Row],[doe]]","v":"0-50"},{"$f":"lcc[[#This Row],[max er]]","v":"50-100"},{"$f":"lcc[[#This Row],[Column1]]","v":"-"},{"$f":"lcc[[#This Row],[_1]]","v":"-"},{"$f":"lcc[[#This Row],[_2]]","v":"-"}]
["constant","IL",{"$f":"lcc[[#This Row],[doe]]","v":"0-50"},{"$f":"lcc[[#This Row],[max er]]","v":"100+"},{"$f":"lcc[[#This Row],[Column1]]","v":"-"},{"$f":"lcc[[#This Row],[_1]]","v":"-"},{"$f":"lcc[[#This Row],[_2]]","v":"-"}]
["constant","IL",{"$f":"lcc[[#This Row],[doe]]","v":"50-100"},{"$f":"lcc[[#This Row],[max er]]","v":"0-50"},{"$f":"lcc[[#This Row],[Column1]]","v":2},{"$f":"lcc[[#This Row],[_1]]","v":10},{"$f":"lcc[[#This Row],[_2]]","v":15}]
["constant","IL",{"$f":"lcc[[#This Row],[doe]]","v":"50-100"},{"$f":"lcc[[#This Row],[max er]]","v":"50-100"},{"$f":"lcc[[#This Row],[Column1]]","v":1},{"$f":"lcc[[#This Row],[_1]]","v":14},{"$f":"lcc[[#This Row],[_2]]","v":20}]
["constant","IL",{"$f":"lcc[[#This Row],[doe]]","v":"50-100"},{"$f":"lcc[[#This Row],[max er]]","v":"100+"},{"$f":"lcc[[#This Row],[Column1]]","v":16},{"$f":"lcc[[#This Row],[_1]]","v":17},{"$f":"lcc[[#This Row],[_2]]","v":19}]
["constant","IL",{"$f":"lcc[[#This Row],[doe]]","v":"100-150"},{"$f":"lcc[[#This Row],[max er]]","v":"0-50"},{"$f":"lcc[[#This Row],[Column1]]","v":1},{"$f":"lcc[[#This Row],[_1]]","v":8},{"$f":"lcc[[#This Row],[_2]]","v":13}]
["constant","IL",{"$f":"lcc[[#This Row],[doe]]","v":"100-150"},{"$f":"lcc[[#This Row],[max er]]","v":"50-100"},{"$f":"lcc[[#This Row],[Column1]]","v":7},{"$f":"lcc[[#This Row],[_1]]","v":12},{"$f":"lcc[[#This Row],[_2]]","v":15}]
["constant","IL",{"$f":"lcc[[#This Row],[doe]]","v":"100-150"},{"$f":"lcc[[#This Row],[max er]]","v":"100+"},{"$f":"lcc[[#This Row],[Column1]]","v":12},{"$f":"lcc[[#This Row],[_1]]","v":15},{"$f":"lcc[[#This Row],[_2]]","v":20}]
["constant","IL",{"$f":"lcc[[#This Row],[doe]]","v":"150-200"},{"$f":"lcc[[#This Row],[max er]]","v":"0-50"},{"$f":"lcc[[#This Row],[Column1]]","v":3},{"$f":"lcc[[#This Row],[_1]]","v":8},{"$f":"lcc[[#This Row],[_2]]","v":9}]
["constant","IL",{"$f":"lcc[[#This Row],[doe]]","v":"150-200"},{"$f":"lcc[[#This Row],[max er]]","v":"50-100"},{"$f":"lcc[[#This Row],[Column1]]","v":2},{"$f":"lcc[[#This Row],[_1]]","v":7},{"$f":"lcc[[#This Row],[_2]]","v":12}]
["constant","IL",{"$f":"lcc[[#This Row],[doe]]","v":"150-200"},{"$f":"lcc[[#This Row],[max er]]","v":"100+"},{"$f":"lcc[[#This Row],[Column1]]","v":7},{"$f":"lcc[[#This Row],[_1]]","v":15},{"$f":"lcc[[#This Row],[_2]]","v":26}]
["constant","IL",{"$f":"lcc[[#This Row],[doe]]","v":"200-300"},{"$f":"lcc[[#This Row],[max er]]","v":"0-50"},{"$f":"lcc[[#This Row],[Column1]]","v":3},{"$f":"lcc[[#This Row],[_1]]","v":6},{"$f":"lcc[[#This Row],[_2]]","v":11}]
["constant","IL",{"$f":"lcc[[#This Row],[doe]]","v":"200-300"},{"$f":"lcc[[#This Row],[max er]]","v":"50-100"},{"$f":"lcc[[#This Row],[Column1]]","v":6},{"$f":"lcc[[#This Row],[_1]]","v":9},{"$f":"lcc[[#This Row],[_2]]","v":14}]
["constant","IL",{"$f":"lcc[[#This Row],[doe]]","v":"200-300"},{"$f":"lcc[[#This Row],[max er]]","v":"100+"},{"$f":"lcc[[#This Row],[Column1]]","v":2},{"$f":"lcc[[#This Row],[_1]]","v":9},{"$f":"lcc[[#This Row],[_2]]","v":15}]
["constant","IL",{"$f":"lcc[[#This Row],[doe]]","v":"300-800"},{"$f":"lcc[[#This Row],[max er]]","v":"0-50"},{"$f":"lcc[[#This Row],[Column1]]","v":3},{"$f":"lcc[[#This Row],[_1]]","v":5},{"$f":"lcc[[#This Row],[_2]]","v":8}]
["constant","IL",{"$f":"lcc[[#This Row],[doe]]","v":"300-800"},{"$f":"lcc[[#This Row],[max er]]","v":"50-100"},{"$f":"lcc[[#This Row],[Column1]]","v":3},{"$f":"lcc[[#This Row],[_1]]","v":6},{"$f":"lcc[[#This Row],[_2]]","v":11}]
["constant","IL",{"$f":"lcc[[#This Row],[doe]]","v":"300-800"},{"$f":"lcc[[#This Row],[max er]]","v":"100+"},{"$f":"lcc[[#This Row],[Column1]]","v":1},{"$f":"lcc[[#This Row],[_1]]","v":7},{"$f":"lcc[[#This Row],[_2]]","v":15}]
["constant","IL",{"$f":"lcc[[#This Row],[doe]]","v":"800+"},{"$f":"lcc[[#This Row],[max er]]","v":"0-50"},{"$f":"lcc[[#This Row],[Column1]]","v":"-"},{"$f":"lcc[[#This Row],[_1]]","v":"-"},{"$f":"lcc[[#This Row],[_2]]","v":"-"}]
["constant","IL",{"$f":"lcc[[#This Row],[doe]]","v":"800+"},{"$f":"lcc[[#This Row],[max er]]","v":"50-100"},{"$f":"lcc[[#This Row],[Column1]]","v":1},{"$f":"lcc[[#This Row],[_1]]","v":3},{"$f":"lcc[[#This Row],[_2]]","v":5}]
["constant","IL",{"$f":"lcc[[#This Row],[doe]]","v":"800+"},{"$f":"lcc[[#This Row],[max er]]","v":"100+"},{"$f":"lcc[[#This Row],[Column1]]","v":1},{"$f":"lcc[[#This Row],[_1]]","v":5},{"$f":"lcc[[#This Row],[_2]]","v":13}]
["constant","RSV",{"$f":"lcc[[#This Row],[doe]]","v":"0-50"},{"$f":"lcc[[#This Row],[max er]]","v":"0-50"},{"$f":"lcc[[#This Row],[Column1]]","v":"-"},{"$f":"lcc[[#This Row],[_1]]","v":"-"},{"$f":"lcc[[#This Row],[_2]]","v":"-"}]
["constant","RSV",{"$f":"lcc[[#This Row],[doe]]","v":"0-50"},{"$f":"lcc[[#This Row],[max er]]","v":"50-100"},{"$f":"lcc[[#This Row],[Column1]]","v":6},{"$f":"lcc[[#This Row],[_1]]","v":13},{"$f":"lcc[[#This Row],[_2]]","v":15}]
["constant","RSV",{"$f":"lcc[[#This Row],[doe]]","v":"0-50"},{"$f":"lcc[[#This Row],[max er]]","v":"100+"},{"$f":"lcc[[#This Row],[Column1]]","v":8},{"$f":"lcc[[#This Row],[_1]]","v":10},{"$f":"lcc[[#This Row],[_2]]","v":13}]
["constant","RSV",{"$f":"lcc[[#This Row],[doe]]","v":"50-100"},{"$f":"lcc[[#This Row],[max er]]","v":"0-50"},{"$f":"lcc[[#This Row],[Column1]]","v":"-"},{"$f":"lcc[[#This Row],[_1]]","v":"-"},{"$f":"lcc[[#This Row],[_2]]","v":"-"}]
["constant","RSV",{"$f":"lcc[[#This Row],[doe]]","v":"50-100"},{"$f":"lcc[[#This Row],[max er]]","v":"50-100"},{"$f":"lcc[[#This Row],[Column1]]","v":5},{"$f":"lcc[[#This Row],[_1]]","v":8},{"$f":"lcc[[#This Row],[_2]]","v":10}]
["constant","RSV",{"$f":"lcc[[#This Row],[doe]]","v":"50-100"},{"$f":"lcc[[#This Row],[max er]]","v":"100+"},{"$f":"lcc[[#This Row],[Column1]]","v":4},{"$f":"lcc[[#This Row],[_1]]","v":16},{"$f":"lcc[[#This Row],[_2]]","v":18}]
["constant","RSV",{"$f":"lcc[[#This Row],[doe]]","v":"100-150"},{"$f":"lcc[[#This Row],[max er]]","v":"0-50"},{"$f":"lcc[[#This Row],[Column1]]","v":"-"},{"$f":"lcc[[#This Row],[_1]]","v":"-"},{"$f":"lcc[[#This Row],[_2]]","v":"-"}]
["constant","RSV",{"$f":"lcc[[#This Row],[doe]]","v":"100-150"},{"$f":"lcc[[#This Row],[max er]]","v":"50-100"},{"$f":"lcc[[#This Row],[Column1]]","v":9},{"$f":"lcc[[#This Row],[_1]]","v":10},{"$f":"lcc[[#This Row],[_2]]","v":12}]
["constant","RSV",{"$f":"lcc[[#This Row],[doe]]","v":"100-150"},{"$f":"lcc[[#This Row],[max er]]","v":"100+"},{"$f":"lcc[[#This Row],[Column1]]","v":4},{"$f":"lcc[[#This Row],[_1]]","v":9},{"$f":"lcc[[#This Row],[_2]]","v":12}]
["constant","RSV",{"$f":"lcc[[#This Row],[doe]]","v":"150-200"},{"$f":"lcc[[#This Row],[max er]]","v":"0-50"},{"$f":"lcc[[#This Row],[Column1]]","v":"-"},{"$f":"lcc[[#This Row],[_1]]","v":"-"},{"$f":"lcc[[#This Row],[_2]]","v":"-"}]
["constant","RSV",{"$f":"lcc[[#This Row],[doe]]","v":"150-200"},{"$f":"lcc[[#This Row],[max er]]","v":"50-100"},{"$f":"lcc[[#This Row],[Column1]]","v":2},{"$f":"lcc[[#This Row],[_1]]","v":5},{"$f":"lcc[[#This Row],[_2]]","v":6}]
["constant","RSV",{"$f":"lcc[[#This Row],[doe]]","v":"150-200"},{"$f":"lcc[[#This Row],[max er]]","v":"100+"},{"$f":"lcc[[#This Row],[Column1]]","v":9},{"$f":"lcc[[#This Row],[_1]]","v":12},{"$f":"lcc[[#This Row],[_2]]","v":13}]
["constant","RSV",{"$f":"lcc[[#This Row],[doe]]","v":"200-300"},{"$f":"lcc[[#This Row],[max er]]","v":"0-50"},{"$f":"lcc[[#This Row],[Column1]]","v":"-"},{"$f":"lcc[[#This Row],[_1]]","v":"-"},{"$f":"lcc[[#This Row],[_2]]","v":"-"}]
["constant","RSV",{"$f":"lcc[[#This Row],[doe]]","v":"200-300"},{"$f":"lcc[[#This Row],[max er]]","v":"50-100"},{"$f":"lcc[[#This Row],[Column1]]","v":1},{"$f":"lcc[[#This Row],[_1]]","v":3},{"$f":"lcc[[#This Row],[_2]]","v":6}]
["constant","RSV",{"$f":"lcc[[#This Row],[doe]]","v":"200-300"},{"$f":"lcc[[#This Row],[max er]]","v":"100+"},{"$f":"lcc[[#This Row],[Column1]]","v":6},{"$f":"lcc[[#This Row],[_1]]","v":11},{"$f":"lcc[[#This Row],[_2]]","v":12}]
["constant","RSV",{"$f":"lcc[[#This Row],[doe]]","v":"300-800"},{"$f":"lcc[[#This Row],[max er]]","v":"0-50"},{"$f":"lcc[[#This Row],[Column1]]","v":"-"},{"$f":"lcc[[#This Row],[_1]]","v":"-"},{"$f":"lcc[[#This Row],[_2]]","v":"-"}]
["constant","RSV",{"$f":"lcc[[#This Row],[doe]]","v":"300-800"},{"$f":"lcc[[#This Row],[max er]]","v":"50-100"},{"$f":"lcc[[#This Row],[Column1]]","v":6},{"$f":"lcc[[#This Row],[_1]]","v":6},{"$f":"lcc[[#This Row],[_2]]","v":6}]
["constant","RSV",{"$f":"lcc[[#This Row],[doe]]","v":"300-800"},{"$f":"lcc[[#This Row],[max er]]","v":"100+"},{"$f":"lcc[[#This Row],[Column1]]","v":2},{"$f":"lcc[[#This Row],[_1]]","v":6},{"$f":"lcc[[#This Row],[_2]]","v":18}]
["constant","RSV",{"$f":"lcc[[#This Row],[doe]]","v":"800+"},{"$f":"lcc[[#This Row],[max er]]","v":"0-50"},{"$f":"lcc[[#This Row],[Column1]]","v":"-"},{"$f":"lcc[[#This Row],[_1]]","v":"-"},{"$f":"lcc[[#This Row],[_2]]","v":"-"}]
["constant","RSV",{"$f":"lcc[[#This Row],[doe]]","v":"800+"},{"$f":"lcc[[#This Row],[max er]]","v":"50-100"},{"$f":"lcc[[#This Row],[Column1]]","v":"-"},{"$f":"lcc[[#This Row],[_1]]","v":"-"},{"$f":"lcc[[#This Row],[_2]]","v":"-"}]
["constant","RSV",{"$f":"lcc[[#This Row],[doe]]","v":"800+"},{"$f":"lcc[[#This Row],[max er]]","v":"100+"},{"$f":"lcc[[#This Row],[Column1]]","v":"-"},{"$f":"lcc[[#This Row],[_1]]","v":"-"},{"$f":"lcc[[#This Row],[_2]]","v":"-"}]
["constant","ST",{"$f":"lcc[[#This Row],[doe]]","v":"0-50"},{"$f":"lcc[[#This Row],[max er]]","v":"0-50"},{"$f":"lcc[[#This Row],[Column1]]","v":"-"},{"$f":"lcc[[#This Row],[_1]]","v":"-"},{"$f":"lcc[[#This Row],[_2]]","v":"-"}]
["constant","ST",{"$f":"lcc[[#This Row],[doe]]","v":"0-50"},{"$f":"lcc[[#This Row],[max er]]","v":"50-100"},{"$f":"lcc[[#This Row],[Column1]]","v":"-"},{"$f":"lcc[[#This Row],[_1]]","v":"-"},{"$f":"lcc[[#This Row],[_2]]","v":"-"}]
["constant","ST",{"$f":"lcc[[#This Row],[doe]]","v":"0-50"},{"$f":"lcc[[#This Row],[max er]]","v":"100+"},{"$f":"lcc[[#This Row],[Column1]]","v":7},{"$f":"lcc[[#This Row],[_1]]","v":20},{"$f":"lcc[[#This Row],[_2]]","v":25}]
["constant","ST",{"$f":"lcc[[#This Row],[doe]]","v":"50-100"},{"$f":"lcc[[#This Row],[max er]]","v":"0-50"},{"$f":"lcc[[#This Row],[Column1]]","v":"-"},{"$f":"lcc[[#This Row],[_1]]","v":"-"},{"$f":"lcc[[#This Row],[_2]]","v":"-"}]
["constant","ST",{"$f":"lcc[[#This Row],[doe]]","v":"50-100"},{"$f":"lcc[[#This Row],[max er]]","v":"50-100"},{"$f":"lcc[[#This Row],[Column1]]","v":"-"},{"$f":"lcc[[#This Row],[_1]]","v":"-"},{"$f":"lcc[[#This Row],[_2]]","v":"-"}]
["constant","ST",{"$f":"lcc[[#This Row],[doe]]","v":"50-100"},{"$f":"lcc[[#This Row],[max er]]","v":"100+"},{"$f":"lcc[[#This Row],[Column1]]","v":2},{"$f":"lcc[[#This Row],[_1]]","v":8},{"$f":"lcc[[#This Row],[_2]]","v":18}]
["constant","ST",{"$f":"lcc[[#This Row],[doe]]","v":"100-150"},{"$f":"lcc[[#This Row],[max er]]","v":"0-50"},{"$f":"lcc[[#This Row],[Column1]]","v":"-"},{"$f":"lcc[[#This Row],[_1]]","v":"-"},{"$f":"lcc[[#This Row],[_2]]","v":"-"}]
["constant","ST",{"$f":"lcc[[#This Row],[doe]]","v":"100-150"},{"$f":"lcc[[#This Row],[max er]]","v":"50-100"},{"$f":"lcc[[#This Row],[Column1]]","v":3},{"$f":"lcc[[#This Row],[_1]]","v":3},{"$f":"lcc[[#This Row],[_2]]","v":3}]
["constant","ST",{"$f":"lcc[[#This Row],[doe]]","v":"100-150"},{"$f":"lcc[[#This Row],[max er]]","v":"100+"},{"$f":"lcc[[#This Row],[Column1]]","v":3},{"$f":"lcc[[#This Row],[_1]]","v":5},{"$f":"lcc[[#This Row],[_2]]","v":6}]
["constant","ST",{"$f":"lcc[[#This Row],[doe]]","v":"150-200"},{"$f":"lcc[[#This Row],[max er]]","v":"0-50"},{"$f":"lcc[[#This Row],[Column1]]","v":"-"},{"$f":"lcc[[#This Row],[_1]]","v":"-"},{"$f":"lcc[[#This Row],[_2]]","v":"-"}]
["constant","ST",{"$f":"lcc[[#This Row],[doe]]","v":"150-200"},{"$f":"lcc[[#This Row],[max er]]","v":"50-100"},{"$f":"lcc[[#This Row],[Column1]]","v":"-"},{"$f":"lcc[[#This Row],[_1]]","v":"-"},{"$f":"lcc[[#This Row],[_2]]","v":"-"}]
["constant","ST",{"$f":"lcc[[#This Row],[doe]]","v":"150-200"},{"$f":"lcc[[#This Row],[max er]]","v":"100+"},{"$f":"lcc[[#This Row],[Column1]]","v":0},{"$f":"lcc[[#This Row],[_1]]","v":4},{"$f":"lcc[[#This Row],[_2]]","v":10}]
["constant","ST",{"$f":"lcc[[#This Row],[doe]]","v":"200-300"},{"$f":"lcc[[#This Row],[max er]]","v":"0-50"},{"$f":"lcc[[#This Row],[Column1]]","v":3},{"$f":"lcc[[#This Row],[_1]]","v":3},{"$f":"lcc[[#This Row],[_2]]","v":3}]
["constant","ST",{"$f":"lcc[[#This Row],[doe]]","v":"200-300"},{"$f":"lcc[[#This Row],[max er]]","v":"50-100"},{"$f":"lcc[[#This Row],[Column1]]","v":"-"},{"$f":"lcc[[#This Row],[_1]]","v":"-"},{"$f":"lcc[[#This Row],[_2]]","v":"-"}]
["constant","ST",{"$f":"lcc[[#This Row],[doe]]","v":"200-300"},{"$f":"lcc[[#This Row],[max er]]","v":"100+"},{"$f":"lcc[[#This Row],[Column1]]","v":3},{"$f":"lcc[[#This Row],[_1]]","v":8},{"$f":"lcc[[#This Row],[_2]]","v":9}]
["constant","ST",{"$f":"lcc[[#This Row],[doe]]","v":"300-800"},{"$f":"lcc[[#This Row],[max er]]","v":"0-50"},{"$f":"lcc[[#This Row],[Column1]]","v":"-"},{"$f":"lcc[[#This Row],[_1]]","v":"-"},{"$f":"lcc[[#This Row],[_2]]","v":"-"}]
["constant","ST",{"$f":"lcc[[#This Row],[doe]]","v":"300-800"},{"$f":"lcc[[#This Row],[max er]]","v":"50-100"},{"$f":"lcc[[#This Row],[Column1]]","v":"-"},{"$f":"lcc[[#This Row],[_1]]","v":"-"},{"$f":"lcc[[#This Row],[_2]]","v":"-"}]
["constant","ST",{"$f":"lcc[[#This Row],[doe]]","v":"300-800"},{"$f":"lcc[[#This Row],[max er]]","v":"100+"},{"$f":"lcc[[#This Row],[Column1]]","v":6},{"$f":"lcc[[#This Row],[_1]]","v":8},{"$f":"lcc[[#This Row],[_2]]","v":12}]
["constant","ST",{"$f":"lcc[[#This Row],[doe]]","v":"800+"},{"$f":"lcc[[#This Row],[max er]]","v":"0-50"},{"$f":"lcc[[#This Row],[Column1]]","v":"-"},{"$f":"lcc[[#This Row],[_1]]","v":"-"},{"$f":"lcc[[#This Row],[_2]]","v":"-"}]
["constant","ST",{"$f":"lcc[[#This Row],[doe]]","v":"800+"},{"$f":"lcc[[#This Row],[max er]]","v":"50-100"},{"$f":"lcc[[#This Row],[Column1]]","v":"-"},{"$f":"lcc[[#This Row],[_1]]","v":"-"},{"$f":"lcc[[#This Row],[_2]]","v":"-"}]
["constant","ST",{"$f":"lcc[[#This Row],[doe]]","v":"800+"},{"$f":"lcc[[#This Row],[max er]]","v":"100+"},{"$f":"lcc[[#This Row],[Column1]]","v":"-"},{"$f":"lcc[[#This Row],[_1]]","v":"-"},{"$f":"lcc[[#This Row],[_2]]","v":"-"}]
["constant","ESCC",{"$f":"lcc[[#This Row],[doe]]","v":"0-50"},{"$f":"lcc[[#This Row],[max er]]","v":"0-50"},{"$f":"lcc[[#This Row],[Column1]]","v":"-"},{"$f":"lcc[[#This Row],[_1]]","v":"-"},{"$f":"lcc[[#This Row],[_2]]","v":"-"}]
["constant","ESCC",{"$f":"lcc[[#This Row],[doe]]","v":"0-50"},{"$f":"lcc[[#This Row],[max er]]","v":"50-100"},{"$f":"lcc[[#This Row],[Column1]]","v":8},{"$f":"lcc[[#This Row],[_1]]","v":11},{"$f":"lcc[[#This Row],[_2]]","v":19}]
["constant","ESCC",{"$f":"lcc[[#This Row],[doe]]","v":"0-50"},{"$f":"lcc[[#This Row],[max er]]","v":"100+"},{"$f":"lcc[[#This Row],[Column1]]","v":4},{"$f":"lcc[[#This Row],[_1]]","v":14},{"$f":"lcc[[#This Row],[_2]]","v":24}]
["constant","ESCC",{"$f":"lcc[[#This Row],[doe]]","v":"50-100"},{"$f":"lcc[[#This Row],[max er]]","v":"0-50"},{"$f":"lcc[[#This Row],[Column1]]","v":0},{"$f":"lcc[[#This Row],[_1]]","v":7},{"$f":"lcc[[#This Row],[_2]]","v":17}]
["constant","ESCC",{"$f":"lcc[[#This Row],[doe]]","v":"50-100"},{"$f":"lcc[[#This Row],[max er]]","v":"50-100"},{"$f":"lcc[[#This Row],[Column1]]","v":0},{"$f":"lcc[[#This Row],[_1]]","v":11},{"$f":"lcc[[#This Row],[_2]]","v":28}]
["constant","ESCC",{"$f":"lcc[[#This Row],[doe]]","v":"50-100"},{"$f":"lcc[[#This Row],[max er]]","v":"100+"},{"$f":"lcc[[#This Row],[Column1]]","v":1},{"$f":"lcc[[#This Row],[_1]]","v":10},{"$f":"lcc[[#This Row],[_2]]","v":17}]
["constant","ESCC",{"$f":"lcc[[#This Row],[doe]]","v":"100-150"},{"$f":"lcc[[#This Row],[max er]]","v":"0-50"},{"$f":"lcc[[#This Row],[Column1]]","v":1},{"$f":"lcc[[#This Row],[_1]]","v":8},{"$f":"lcc[[#This Row],[_2]]","v":15}]
["constant","ESCC",{"$f":"lcc[[#This Row],[doe]]","v":"100-150"},{"$f":"lcc[[#This Row],[max er]]","v":"50-100"},{"$f":"lcc[[#This Row],[Column1]]","v":1},{"$f":"lcc[[#This Row],[_1]]","v":10},{"$f":"lcc[[#This Row],[_2]]","v":17}]
["constant","ESCC",{"$f":"lcc[[#This Row],[doe]]","v":"100-150"},{"$f":"lcc[[#This Row],[max er]]","v":"100+"},{"$f":"lcc[[#This Row],[Column1]]","v":1},{"$f":"lcc[[#This Row],[_1]]","v":12},{"$f":"lcc[[#This Row],[_2]]","v":25}]
["constant","ESCC",{"$f":"lcc[[#This Row],[doe]]","v":"150-200"},{"$f":"lcc[[#This Row],[max er]]","v":"0-50"},{"$f":"lcc[[#This Row],[Column1]]","v":1},{"$f":"lcc[[#This Row],[_1]]","v":7},{"$f":"lcc[[#This Row],[_2]]","v":14}]
["constant","ESCC",{"$f":"lcc[[#This Row],[doe]]","v":"150-200"},{"$f":"lcc[[#This Row],[max er]]","v":"50-100"},{"$f":"lcc[[#This Row],[Column1]]","v":1},{"$f":"lcc[[#This Row],[_1]]","v":9},{"$f":"lcc[[#This Row],[_2]]","v":17}]
["constant","ESCC",{"$f":"lcc[[#This Row],[doe]]","v":"150-200"},{"$f":"lcc[[#This Row],[max er]]","v":"100+"},{"$f":"lcc[[#This Row],[Column1]]","v":0},{"$f":"lcc[[#This Row],[_1]]","v":9},{"$f":"lcc[[#This Row],[_2]]","v":19}]
["constant","ESCC",{"$f":"lcc[[#This Row],[doe]]","v":"200-300"},{"$f":"lcc[[#This Row],[max er]]","v":"0-50"},{"$f":"lcc[[#This Row],[Column1]]","v":2},{"$f":"lcc[[#This Row],[_1]]","v":7},{"$f":"lcc[[#This Row],[_2]]","v":10}]
["constant","ESCC",{"$f":"lcc[[#This Row],[doe]]","v":"200-300"},{"$f":"lcc[[#This Row],[max er]]","v":"50-100"},{"$f":"lcc[[#This Row],[Column1]]","v":-4},{"$f":"lcc[[#This Row],[_1]]","v":7},{"$f":"lcc[[#This Row],[_2]]","v":16}]
["constant","ESCC",{"$f":"lcc[[#This Row],[doe]]","v":"200-300"},{"$f":"lcc[[#This Row],[max er]]","v":"100+"},{"$f":"lcc[[#This Row],[Column1]]","v":1},{"$f":"lcc[[#This Row],[_1]]","v":9},{"$f":"lcc[[#This Row],[_2]]","v":17}]
["constant","ESCC",{"$f":"lcc[[#This Row],[doe]]","v":"300-800"},{"$f":"lcc[[#This Row],[max er]]","v":"0-50"},{"$f":"lcc[[#This Row],[Column1]]","v":0},{"$f":"lcc[[#This Row],[_1]]","v":6},{"$f":"lcc[[#This Row],[_2]]","v":11}]
["constant","ESCC",{"$f":"lcc[[#This Row],[doe]]","v":"300-800"},{"$f":"lcc[[#This Row],[max er]]","v":"50-100"},{"$f":"lcc[[#This Row],[Column1]]","v":1},{"$f":"lcc[[#This Row],[_1]]","v":5},{"$f":"lcc[[#This Row],[_2]]","v":10}]
["constant","ESCC",{"$f":"lcc[[#This Row],[doe]]","v":"300-800"},{"$f":"lcc[[#This Row],[max er]]","v":"100+"},{"$f":"lcc[[#This Row],[Column1]]","v":0},{"$f":"lcc[[#This Row],[_1]]","v":7},{"$f":"lcc[[#This Row],[_2]]","v":18}]
["constant","ESCC",{"$f":"lcc[[#This Row],[doe]]","v":"800+"},{"$f":"lcc[[#This Row],[max er]]","v":"0-50"},{"$f":"lcc[[#This Row],[Column1]]","v":1},{"$f":"lcc[[#This Row],[_1]]","v":1},{"$f":"lcc[[#This Row],[_2]]","v":1}]
["constant","ESCC",{"$f":"lcc[[#This Row],[doe]]","v":"800+"},{"$f":"lcc[[#This Row],[max er]]","v":"50-100"},{"$f":"lcc[[#This Row],[Column1]]","v":0},{"$f":"lcc[[#This Row],[_1]]","v":4},{"$f":"lcc[[#This Row],[_2]]","v":8}]
["constant","ESCC",{"$f":"lcc[[#This Row],[doe]]","v":"800+"},{"$f":"lcc[[#This Row],[max er]]","v":"100+"},{"$f":"lcc[[#This Row],[Column1]]","v":0},{"$f":"lcc[[#This Row],[_1]]","v":4},{"$f":"lcc[[#This Row],[_2]]","v":9}]
["constant","ESFM",{"$f":"lcc[[#This Row],[doe]]","v":"0-50"},{"$f":"lcc[[#This Row],[max er]]","v":"0-50"},{"$f":"lcc[[#This Row],[Column1]]","v":"-"},{"$f":"lcc[[#This Row],[_1]]","v":"-"},{"$f":"lcc[[#This Row],[_2]]","v":"-"}]
["constant","ESFM",{"$f":"lcc[[#This Row],[doe]]","v":"0-50"},{"$f":"lcc[[#This Row],[max er]]","v":"50-100"},{"$f":"lcc[[#This Row],[Column1]]","v":15},{"$f":"lcc[[#This Row],[_1]]","v":15},{"$f":"lcc[[#This Row],[_2]]","v":15}]
["constant","ESFM",{"$f":"lcc[[#This Row],[doe]]","v":"0-50"},{"$f":"lcc[[#This Row],[max er]]","v":"100+"},{"$f":"lcc[[#This Row],[Column1]]","v":6},{"$f":"lcc[[#This Row],[_1]]","v":16},{"$f":"lcc[[#This Row],[_2]]","v":21}]
["constant","ESFM",{"$f":"lcc[[#This Row],[doe]]","v":"50-100"},{"$f":"lcc[[#This Row],[max er]]","v":"0-50"},{"$f":"lcc[[#This Row],[Column1]]","v":2},{"$f":"lcc[[#This Row],[_1]]","v":7},{"$f":"lcc[[#This Row],[_2]]","v":12}]
["constant","ESFM",{"$f":"lcc[[#This Row],[doe]]","v":"50-100"},{"$f":"lcc[[#This Row],[max er]]","v":"50-100"},{"$f":"lcc[[#This Row],[Column1]]","v":1},{"$f":"lcc[[#This Row],[_1]]","v":9},{"$f":"lcc[[#This Row],[_2]]","v":30}]
["constant","ESFM",{"$f":"lcc[[#This Row],[doe]]","v":"50-100"},{"$f":"lcc[[#This Row],[max er]]","v":"100+"},{"$f":"lcc[[#This Row],[Column1]]","v":1},{"$f":"lcc[[#This Row],[_1]]","v":12},{"$f":"lcc[[#This Row],[_2]]","v":18}]
["constant","ESFM",{"$f":"lcc[[#This Row],[doe]]","v":"100-150"},{"$f":"lcc[[#This Row],[max er]]","v":"0-50"},{"$f":"lcc[[#This Row],[Column1]]","v":2},{"$f":"lcc[[#This Row],[_1]]","v":8},{"$f":"lcc[[#This Row],[_2]]","v":14}]
["constant","ESFM",{"$f":"lcc[[#This Row],[doe]]","v":"100-150"},{"$f":"lcc[[#This Row],[max er]]","v":"50-100"},{"$f":"lcc[[#This Row],[Column1]]","v":2},{"$f":"lcc[[#This Row],[_1]]","v":13},{"$f":"lcc[[#This Row],[_2]]","v":20}]
["constant","ESFM",{"$f":"lcc[[#This Row],[doe]]","v":"100-150"},{"$f":"lcc[[#This Row],[max er]]","v":"100+"},{"$f":"lcc[[#This Row],[Column1]]","v":1},{"$f":"lcc[[#This Row],[_1]]","v":12},{"$f":"lcc[[#This Row],[_2]]","v":25}]
["constant","ESFM",{"$f":"lcc[[#This Row],[doe]]","v":"150-200"},{"$f":"lcc[[#This Row],[max er]]","v":"0-50"},{"$f":"lcc[[#This Row],[Column1]]","v":1},{"$f":"lcc[[#This Row],[_1]]","v":8},{"$f":"lcc[[#This Row],[_2]]","v":16}]
["constant","ESFM",{"$f":"lcc[[#This Row],[doe]]","v":"150-200"},{"$f":"lcc[[#This Row],[max er]]","v":"50-100"},{"$f":"lcc[[#This Row],[Column1]]","v":1},{"$f":"lcc[[#This Row],[_1]]","v":12},{"$f":"lcc[[#This Row],[_2]]","v":16}]
["constant","ESFM",{"$f":"lcc[[#This Row],[doe]]","v":"150-200"},{"$f":"lcc[[#This Row],[max er]]","v":"100+"},{"$f":"lcc[[#This Row],[Column1]]","v":0},{"$f":"lcc[[#This Row],[_1]]","v":9},{"$f":"lcc[[#This Row],[_2]]","v":20}]
["constant","ESFM",{"$f":"lcc[[#This Row],[doe]]","v":"200-300"},{"$f":"lcc[[#This Row],[max er]]","v":"0-50"},{"$f":"lcc[[#This Row],[Column1]]","v":3},{"$f":"lcc[[#This Row],[_1]]","v":7},{"$f":"lcc[[#This Row],[_2]]","v":11}]
["constant","ESFM",{"$f":"lcc[[#This Row],[doe]]","v":"200-300"},{"$f":"lcc[[#This Row],[max er]]","v":"50-100"},{"$f":"lcc[[#This Row],[Column1]]","v":1},{"$f":"lcc[[#This Row],[_1]]","v":7},{"$f":"lcc[[#This Row],[_2]]","v":15}]
["constant","ESFM",{"$f":"lcc[[#This Row],[doe]]","v":"200-300"},{"$f":"lcc[[#This Row],[max er]]","v":"100+"},{"$f":"lcc[[#This Row],[Column1]]","v":1},{"$f":"lcc[[#This Row],[_1]]","v":9},{"$f":"lcc[[#This Row],[_2]]","v":18}]
["constant","ESFM",{"$f":"lcc[[#This Row],[doe]]","v":"300-800"},{"$f":"lcc[[#This Row],[max er]]","v":"0-50"},{"$f":"lcc[[#This Row],[Column1]]","v":1},{"$f":"lcc[[#This Row],[_1]]","v":5},{"$f":"lcc[[#This Row],[_2]]","v":11}]
["constant","ESFM",{"$f":"lcc[[#This Row],[doe]]","v":"300-800"},{"$f":"lcc[[#This Row],[max er]]","v":"50-100"},{"$f":"lcc[[#This Row],[Column1]]","v":1},{"$f":"lcc[[#This Row],[_1]]","v":4},{"$f":"lcc[[#This Row],[_2]]","v":11}]
["constant","ESFM",{"$f":"lcc[[#This Row],[doe]]","v":"300-800"},{"$f":"lcc[[#This Row],[max er]]","v":"100+"},{"$f":"lcc[[#This Row],[Column1]]","v":0},{"$f":"lcc[[#This Row],[_1]]","v":7},{"$f":"lcc[[#This Row],[_2]]","v":19}]
["constant","ESFM",{"$f":"lcc[[#This Row],[doe]]","v":"800+"},{"$f":"lcc[[#This Row],[max er]]","v":"0-50"},{"$f":"lcc[[#This Row],[Column1]]","v":2},{"$f":"lcc[[#This Row],[_1]]","v":2},{"$f":"lcc[[#This Row],[_2]]","v":2}]
["constant","ESFM",{"$f":"lcc[[#This Row],[doe]]","v":"800+"},{"$f":"lcc[[#This Row],[max er]]","v":"50-100"},{"$f":"lcc[[#This Row],[Column1]]","v":0},{"$f":"lcc[[#This Row],[_1]]","v":3},{"$f":"lcc[[#This Row],[_2]]","v":9}]
["constant","ESFM",{"$f":"lcc[[#This Row],[doe]]","v":"800+"},{"$f":"lcc[[#This Row],[max er]]","v":"100+"},{"$f":"lcc[[#This Row],[Column1]]","v":0},{"$f":"lcc[[#This Row],[_1]]","v":4},{"$f":"lcc[[#This Row],[_2]]","v":10}]
["constant","IL",{"$f":"lcc[[#This Row],[doe]]","v":"0-50"},{"$f":"lcc[[#This Row],[max er]]","v":"0-50"},{"$f":"lcc[[#This Row],[Column1]]","v":"-"},{"$f":"lcc[[#This Row],[_1]]","v":"-"},{"$f":"lcc[[#This Row],[_2]]","v":"-"}]
["constant","IL",{"$f":"lcc[[#This Row],[doe]]","v":"0-50"},{"$f":"lcc[[#This Row],[max er]]","v":"50-100"},{"$f":"lcc[[#This Row],[Column1]]","v":"-"},{"$f":"lcc[[#This Row],[_1]]","v":"-"},{"$f":"lcc[[#This Row],[_2]]","v":"-"}]
["constant","IL",{"$f":"lcc[[#This Row],[doe]]","v":"0-50"},{"$f":"lcc[[#This Row],[max er]]","v":"100+"},{"$f":"lcc[[#This Row],[Column1]]","v":"-"},{"$f":"lcc[[#This Row],[_1]]","v":"-"},{"$f":"lcc[[#This Row],[_2]]","v":"-"}]
["constant","IL",{"$f":"lcc[[#This Row],[doe]]","v":"50-100"},{"$f":"lcc[[#This Row],[max er]]","v":"0-50"},{"$f":"lcc[[#This Row],[Column1]]","v":1},{"$f":"lcc[[#This Row],[_1]]","v":7},{"$f":"lcc[[#This Row],[_2]]","v":20}]
["constant","IL",{"$f":"lcc[[#This Row],[doe]]","v":"50-100"},{"$f":"lcc[[#This Row],[max er]]","v":"50-100"},{"$f":"lcc[[#This Row],[Column1]]","v":1},{"$f":"lcc[[#This Row],[_1]]","v":12},{"$f":"lcc[[#This Row],[_2]]","v":21}]
["constant","IL",{"$f":"lcc[[#This Row],[doe]]","v":"50-100"},{"$f":"lcc[[#This Row],[max er]]","v":"100+"},{"$f":"lcc[[#This Row],[Column1]]","v":4},{"$f":"lcc[[#This Row],[_1]]","v":9},{"$f":"lcc[[#This Row],[_2]]","v":17}]
["constant","IL",{"$f":"lcc[[#This Row],[doe]]","v":"100-150"},{"$f":"lcc[[#This Row],[max er]]","v":"0-50"},{"$f":"lcc[[#This Row],[Column1]]","v":1},{"$f":"lcc[[#This Row],[_1]]","v":9},{"$f":"lcc[[#This Row],[_2]]","v":15}]
["constant","IL",{"$f":"lcc[[#This Row],[doe]]","v":"100-150"},{"$f":"lcc[[#This Row],[max er]]","v":"50-100"},{"$f":"lcc[[#This Row],[Column1]]","v":0},{"$f":"lcc[[#This Row],[_1]]","v":7},{"$f":"lcc[[#This Row],[_2]]","v":18}]
["constant","IL",{"$f":"lcc[[#This Row],[doe]]","v":"100-150"},{"$f":"lcc[[#This Row],[max er]]","v":"100+"},{"$f":"lcc[[#This Row],[Column1]]","v":4},{"$f":"lcc[[#This Row],[_1]]","v":14},{"$f":"lcc[[#This Row],[_2]]","v":21}]
["constant","IL",{"$f":"lcc[[#This Row],[doe]]","v":"150-200"},{"$f":"lcc[[#This Row],[max er]]","v":"0-50"},{"$f":"lcc[[#This Row],[Column1]]","v":1},{"$f":"lcc[[#This Row],[_1]]","v":6},{"$f":"lcc[[#This Row],[_2]]","v":15}]
["constant","IL",{"$f":"lcc[[#This Row],[doe]]","v":"150-200"},{"$f":"lcc[[#This Row],[max er]]","v":"50-100"},{"$f":"lcc[[#This Row],[Column1]]","v":2},{"$f":"lcc[[#This Row],[_1]]","v":10},{"$f":"lcc[[#This Row],[_2]]","v":20}]
["constant","IL",{"$f":"lcc[[#This Row],[doe]]","v":"150-200"},{"$f":"lcc[[#This Row],[max er]]","v":"100+"},{"$f":"lcc[[#This Row],[Column1]]","v":2},{"$f":"lcc[[#This Row],[_1]]","v":9},{"$f":"lcc[[#This Row],[_2]]","v":26}]
["constant","IL",{"$f":"lcc[[#This Row],[doe]]","v":"200-300"},{"$f":"lcc[[#This Row],[max er]]","v":"0-50"},{"$f":"lcc[[#This Row],[Column1]]","v":3},{"$f":"lcc[[#This Row],[_1]]","v":5},{"$f":"lcc[[#This Row],[_2]]","v":11}]
["constant","IL",{"$f":"lcc[[#This Row],[doe]]","v":"200-300"},{"$f":"lcc[[#This Row],[max er]]","v":"50-100"},{"$f":"lcc[[#This Row],[Column1]]","v":1},{"$f":"lcc[[#This Row],[_1]]","v":6},{"$f":"lcc[[#This Row],[_2]]","v":14}]
["constant","IL",{"$f":"lcc[[#This Row],[doe]]","v":"200-300"},{"$f":"lcc[[#This Row],[max er]]","v":"100+"},{"$f":"lcc[[#This Row],[Column1]]","v":0},{"$f":"lcc[[#This Row],[_1]]","v":7},{"$f":"lcc[[#This Row],[_2]]","v":19}]
["constant","IL",{"$f":"lcc[[#This Row],[doe]]","v":"300-800"},{"$f":"lcc[[#This Row],[max er]]","v":"0-50"},{"$f":"lcc[[#This Row],[Column1]]","v":0},{"$f":"lcc[[#This Row],[_1]]","v":4},{"$f":"lcc[[#This Row],[_2]]","v":10}]
["constant","IL",{"$f":"lcc[[#This Row],[doe]]","v":"300-800"},{"$f":"lcc[[#This Row],[max er]]","v":"50-100"},{"$f":"lcc[[#This Row],[Column1]]","v":0},{"$f":"lcc[[#This Row],[_1]]","v":4},{"$f":"lcc[[#This Row],[_2]]","v":11}]
["constant","IL",{"$f":"lcc[[#This Row],[doe]]","v":"300-800"},{"$f":"lcc[[#This Row],[max er]]","v":"100+"},{"$f":"lcc[[#This Row],[Column1]]","v":0},{"$f":"lcc[[#This Row],[_1]]","v":7},{"$f":"lcc[[#This Row],[_2]]","v":20}]
["constant","IL",{"$f":"lcc[[#This Row],[doe]]","v":"800+"},{"$f":"lcc[[#This Row],[max er]]","v":"0-50"},{"$f":"lcc[[#This Row],[Column1]]","v":4},{"$f":"lcc[[#This Row],[_1]]","v":4},{"$f":"lcc[[#This Row],[_2]]","v":4}]
["constant","IL",{"$f":"lcc[[#This Row],[doe]]","v":"800+"},{"$f":"lcc[[#This Row],[max er]]","v":"50-100"},{"$f":"lcc[[#This Row],[Column1]]","v":0},{"$f":"lcc[[#This Row],[_1]]","v":2},{"$f":"lcc[[#This Row],[_2]]","v":7}]
["constant","IL",{"$f":"lcc[[#This Row],[doe]]","v":"800+"},{"$f":"lcc[[#This Row],[max er]]","v":"100+"},{"$f":"lcc[[#This Row],[Column1]]","v":0},{"$f":"lcc[[#This Row],[_1]]","v":4},{"$f":"lcc[[#This Row],[_2]]","v":13}]
["constant","RSV",{"$f":"lcc[[#This Row],[doe]]","v":"0-50"},{"$f":"lcc[[#This Row],[max er]]","v":"0-50"},{"$f":"lcc[[#This Row],[Column1]]","v":"-"},{"$f":"lcc[[#This Row],[_1]]","v":"-"},{"$f":"lcc[[#This Row],[_2]]","v":"-"}]
["constant","RSV",{"$f":"lcc[[#This Row],[doe]]","v":"0-50"},{"$f":"lcc[[#This Row],[max er]]","v":"50-100"},{"$f":"lcc[[#This Row],[Column1]]","v":6},{"$f":"lcc[[#This Row],[_1]]","v":12},{"$f":"lcc[[#This Row],[_2]]","v":17}]
["constant","RSV",{"$f":"lcc[[#This Row],[doe]]","v":"0-50"},{"$f":"lcc[[#This Row],[max er]]","v":"100+"},{"$f":"lcc[[#This Row],[Column1]]","v":9},{"$f":"lcc[[#This Row],[_1]]","v":9},{"$f":"lcc[[#This Row],[_2]]","v":9}]
["constant","RSV",{"$f":"lcc[[#This Row],[doe]]","v":"50-100"},{"$f":"lcc[[#This Row],[max er]]","v":"0-50"},{"$f":"lcc[[#This Row],[Column1]]","v":1},{"$f":"lcc[[#This Row],[_1]]","v":1},{"$f":"lcc[[#This Row],[_2]]","v":1}]
["constant","RSV",{"$f":"lcc[[#This Row],[doe]]","v":"50-100"},{"$f":"lcc[[#This Row],[max er]]","v":"50-100"},{"$f":"lcc[[#This Row],[Column1]]","v":5},{"$f":"lcc[[#This Row],[_1]]","v":7},{"$f":"lcc[[#This Row],[_2]]","v":9}]
["constant","RSV",{"$f":"lcc[[#This Row],[doe]]","v":"50-100"},{"$f":"lcc[[#This Row],[max er]]","v":"100+"},{"$f":"lcc[[#This Row],[Column1]]","v":6},{"$f":"lcc[[#This Row],[_1]]","v":10},{"$f":"lcc[[#This Row],[_2]]","v":14}]
["constant","RSV",{"$f":"lcc[[#This Row],[doe]]","v":"100-150"},{"$f":"lcc[[#This Row],[max er]]","v":"0-50"},{"$f":"lcc[[#This Row],[Column1]]","v":"-"},{"$f":"lcc[[#This Row],[_1]]","v":"-"},{"$f":"lcc[[#This Row],[_2]]","v":"-"}]
["constant","RSV",{"$f":"lcc[[#This Row],[doe]]","v":"100-150"},{"$f":"lcc[[#This Row],[max er]]","v":"50-100"},{"$f":"lcc[[#This Row],[Column1]]","v":9},{"$f":"lcc[[#This Row],[_1]]","v":11},{"$f":"lcc[[#This Row],[_2]]","v":12}]
["constant","RSV",{"$f":"lcc[[#This Row],[doe]]","v":"100-150"},{"$f":"lcc[[#This Row],[max er]]","v":"100+"},{"$f":"lcc[[#This Row],[Column1]]","v":1},{"$f":"lcc[[#This Row],[_1]]","v":5},{"$f":"lcc[[#This Row],[_2]]","v":10}]
["constant","RSV",{"$f":"lcc[[#This Row],[doe]]","v":"150-200"},{"$f":"lcc[[#This Row],[max er]]","v":"0-50"},{"$f":"lcc[[#This Row],[Column1]]","v":"-"},{"$f":"lcc[[#This Row],[_1]]","v":"-"},{"$f":"lcc[[#This Row],[_2]]","v":"-"}]
["constant","RSV",{"$f":"lcc[[#This Row],[doe]]","v":"150-200"},{"$f":"lcc[[#This Row],[max er]]","v":"50-100"},{"$f":"lcc[[#This Row],[Column1]]","v":2},{"$f":"lcc[[#This Row],[_1]]","v":4},{"$f":"lcc[[#This Row],[_2]]","v":6}]
["constant","RSV",{"$f":"lcc[[#This Row],[doe]]","v":"150-200"},{"$f":"lcc[[#This Row],[max er]]","v":"100+"},{"$f":"lcc[[#This Row],[Column1]]","v":9},{"$f":"lcc[[#This Row],[_1]]","v":11},{"$f":"lcc[[#This Row],[_2]]","v":13}]
["constant","RSV",{"$f":"lcc[[#This Row],[doe]]","v":"200-300"},{"$f":"lcc[[#This Row],[max er]]","v":"0-50"},{"$f":"lcc[[#This Row],[Column1]]","v":"-"},{"$f":"lcc[[#This Row],[_1]]","v":"-"},{"$f":"lcc[[#This Row],[_2]]","v":"-"}]
["constant","RSV",{"$f":"lcc[[#This Row],[doe]]","v":"200-300"},{"$f":"lcc[[#This Row],[max er]]","v":"50-100"},{"$f":"lcc[[#This Row],[Column1]]","v":1},{"$f":"lcc[[#This Row],[_1]]","v":3},{"$f":"lcc[[#This Row],[_2]]","v":6}]
["constant","RSV",{"$f":"lcc[[#This Row],[doe]]","v":"200-300"},{"$f":"lcc[[#This Row],[max er]]","v":"100+"},{"$f":"lcc[[#This Row],[Column1]]","v":7},{"$f":"lcc[[#This Row],[_1]]","v":10},{"$f":"lcc[[#This Row],[_2]]","v":12}]
["constant","RSV",{"$f":"lcc[[#This Row],[doe]]","v":"300-800"},{"$f":"lcc[[#This Row],[max er]]","v":"0-50"},{"$f":"lcc[[#This Row],[Column1]]","v":"-"},{"$f":"lcc[[#This Row],[_1]]","v":"-"},{"$f":"lcc[[#This Row],[_2]]","v":"-"}]
["constant","RSV",{"$f":"lcc[[#This Row],[doe]]","v":"300-800"},{"$f":"lcc[[#This Row],[max er]]","v":"50-100"},{"$f":"lcc[[#This Row],[Column1]]","v":6},{"$f":"lcc[[#This Row],[_1]]","v":6},{"$f":"lcc[[#This Row],[_2]]","v":6}]
["constant","RSV",{"$f":"lcc[[#This Row],[doe]]","v":"300-800"},{"$f":"lcc[[#This Row],[max er]]","v":"100+"},{"$f":"lcc[[#This Row],[Column1]]","v":2},{"$f":"lcc[[#This Row],[_1]]","v":5},{"$f":"lcc[[#This Row],[_2]]","v":8}]
["constant","RSV",{"$f":"lcc[[#This Row],[doe]]","v":"800+"},{"$f":"lcc[[#This Row],[max er]]","v":"0-50"},{"$f":"lcc[[#This Row],[Column1]]","v":"-"},{"$f":"lcc[[#This Row],[_1]]","v":"-"},{"$f":"lcc[[#This Row],[_2]]","v":"-"}]
["constant","RSV",{"$f":"lcc[[#This Row],[doe]]","v":"800+"},{"$f":"lcc[[#This Row],[max er]]","v":"50-100"},{"$f":"lcc[[#This Row],[Column1]]","v":"-"},{"$f":"lcc[[#This Row],[_1]]","v":"-"},{"$f":"lcc[[#This Row],[_2]]","v":"-"}]
["constant","RSV",{"$f":"lcc[[#This Row],[doe]]","v":"800+"},{"$f":"lcc[[#This Row],[max er]]","v":"100+"},{"$f":"lcc[[#This Row],[Column1]]","v":"-"},{"$f":"lcc[[#This Row],[_1]]","v":"-"},{"$f":"lcc[[#This Row],[_2]]","v":"-"}]
["constant","ST",{"$f":"lcc[[#This Row],[doe]]","v":"0-50"},{"$f":"lcc[[#This Row],[max er]]","v":"0-50"},{"$f":"lcc[[#This Row],[Column1]]","v":"-"},{"$f":"lcc[[#This Row],[_1]]","v":"-"},{"$f":"lcc[[#This Row],[_2]]","v":"-"}]
["constant","ST",{"$f":"lcc[[#This Row],[doe]]","v":"0-50"},{"$f":"lcc[[#This Row],[max er]]","v":"50-100"},{"$f":"lcc[[#This Row],[Column1]]","v":"-"},{"$f":"lcc[[#This Row],[_1]]","v":"-"},{"$f":"lcc[[#This Row],[_2]]","v":"-"}]
["constant","ST",{"$f":"lcc[[#This Row],[doe]]","v":"0-50"},{"$f":"lcc[[#This Row],[max er]]","v":"100+"},{"$f":"lcc[[#This Row],[Column1]]","v":7},{"$f":"lcc[[#This Row],[_1]]","v":11},{"$f":"lcc[[#This Row],[_2]]","v":16}]
["constant","ST",{"$f":"lcc[[#This Row],[doe]]","v":"50-100"},{"$f":"lcc[[#This Row],[max er]]","v":"0-50"},{"$f":"lcc[[#This Row],[Column1]]","v":"-"},{"$f":"lcc[[#This Row],[_1]]","v":"-"},{"$f":"lcc[[#This Row],[_2]]","v":"-"}]
["constant","ST",{"$f":"lcc[[#This Row],[doe]]","v":"50-100"},{"$f":"lcc[[#This Row],[max er]]","v":"50-100"},{"$f":"lcc[[#This Row],[Column1]]","v":"-"},{"$f":"lcc[[#This Row],[_1]]","v":"-"},{"$f":"lcc[[#This Row],[_2]]","v":"-"}]
["constant","ST",{"$f":"lcc[[#This Row],[doe]]","v":"50-100"},{"$f":"lcc[[#This Row],[max er]]","v":"100+"},{"$f":"lcc[[#This Row],[Column1]]","v":5},{"$f":"lcc[[#This Row],[_1]]","v":8},{"$f":"lcc[[#This Row],[_2]]","v":15}]
["constant","ST",{"$f":"lcc[[#This Row],[doe]]","v":"100-150"},{"$f":"lcc[[#This Row],[max er]]","v":"0-50"},{"$f":"lcc[[#This Row],[Column1]]","v":"-"},{"$f":"lcc[[#This Row],[_1]]","v":"-"},{"$f":"lcc[[#This Row],[_2]]","v":"-"}]
["constant","ST",{"$f":"lcc[[#This Row],[doe]]","v":"100-150"},{"$f":"lcc[[#This Row],[max er]]","v":"50-100"},{"$f":"lcc[[#This Row],[Column1]]","v":"-"},{"$f":"lcc[[#This Row],[_1]]","v":"-"},{"$f":"lcc[[#This Row],[_2]]","v":"-"}]
["constant","ST",{"$f":"lcc[[#This Row],[doe]]","v":"100-150"},{"$f":"lcc[[#This Row],[max er]]","v":"100+"},{"$f":"lcc[[#This Row],[Column1]]","v":3},{"$f":"lcc[[#This Row],[_1]]","v":3},{"$f":"lcc[[#This Row],[_2]]","v":3}]
["constant","ST",{"$f":"lcc[[#This Row],[doe]]","v":"150-200"},{"$f":"lcc[[#This Row],[max er]]","v":"0-50"},{"$f":"lcc[[#This Row],[Column1]]","v":"-"},{"$f":"lcc[[#This Row],[_1]]","v":"-"},{"$f":"lcc[[#This Row],[_2]]","v":"-"}]
["constant","ST",{"$f":"lcc[[#This Row],[doe]]","v":"150-200"},{"$f":"lcc[[#This Row],[max er]]","v":"50-100"},{"$f":"lcc[[#This Row],[Column1]]","v":"-"},{"$f":"lcc[[#This Row],[_1]]","v":"-"},{"$f":"lcc[[#This Row],[_2]]","v":"-"}]
["constant","ST",{"$f":"lcc[[#This Row],[doe]]","v":"150-200"},{"$f":"lcc[[#This Row],[max er]]","v":"100+"},{"$f":"lcc[[#This Row],[Column1]]","v":3},{"$f":"lcc[[#This Row],[_1]]","v":6},{"$f":"lcc[[#This Row],[_2]]","v":9}]
["constant","ST",{"$f":"lcc[[#This Row],[doe]]","v":"200-300"},{"$f":"lcc[[#This Row],[max er]]","v":"0-50"},{"$f":"lcc[[#This Row],[Column1]]","v":"-"},{"$f":"lcc[[#This Row],[_1]]","v":"-"},{"$f":"lcc[[#This Row],[_2]]","v":"-"}]
["constant","ST",{"$f":"lcc[[#This Row],[doe]]","v":"200-300"},{"$f":"lcc[[#This Row],[max er]]","v":"50-100"},{"$f":"lcc[[#This Row],[Column1]]","v":"-"},{"$f":"lcc[[#This Row],[_1]]","v":"-"},{"$f":"lcc[[#This Row],[_2]]","v":"-"}]
["constant","ST",{"$f":"lcc[[#This Row],[doe]]","v":"200-300"},{"$f":"lcc[[#This Row],[max er]]","v":"100+"},{"$f":"lcc[[#This Row],[Column1]]","v":3},{"$f":"lcc[[#This Row],[_1]]","v":6},{"$f":"lcc[[#This Row],[_2]]","v":8}]
["constant","ST",{"$f":"lcc[[#This Row],[doe]]","v":"300-800"},{"$f":"lcc[[#This Row],[max er]]","v":"0-50"},{"$f":"lcc[[#This Row],[Column1]]","v":"-"},{"$f":"lcc[[#This Row],[_1]]","v":"-"},{"$f":"lcc[[#This Row],[_2]]","v":"-"}]
["constant","ST",{"$f":"lcc[[#This Row],[doe]]","v":"300-800"},{"$f":"lcc[[#This Row],[max er]]","v":"50-100"},{"$f":"lcc[[#This Row],[Column1]]","v":"-"},{"$f":"lcc[[#This Row],[_1]]","v":"-"},{"$f":"lcc[[#This Row],[_2]]","v":"-"}]
["constant","ST",{"$f":"lcc[[#This Row],[doe]]","v":"300-800"},{"$f":"lcc[[#This Row],[max er]]","v":"100+"},{"$f":"lcc[[#This Row],[Column1]]","v":5},{"$f":"lcc[[#This Row],[_1]]","v":13},{"$f":"lcc[[#This Row],[_2]]","v":19}]
["constant","ST",{"$f":"lcc[[#This Row],[doe]]","v":"800+"},{"$f":"lcc[[#This Row],[max er]]","v":"0-50"},{"$f":"lcc[[#This Row],[Column1]]","v":"-"},{"$f":"lcc[[#This Row],[_1]]","v":"-"},{"$f":"lcc[[#This Row],[_2]]","v":"-"}]
["constant","ST",{"$f":"lcc[[#This Row],[doe]]","v":"800+"},{"$f":"lcc[[#This Row],[max er]]","v":"50-100"},{"$f":"lcc[[#This Row],[Column1]]","v":"-"},{"$f":"lcc[[#This Row],[_1]]","v":"-"},{"$f":"lcc[[#This Row],[_2]]","v":"-"}]
["constant","ST",{"$f":"lcc[[#This Row],[doe]]","v":"800+"},{"$f":"lcc[[#This Row],[max er]]","v":"100+"},{"$f":"lcc[[#This Row],[Column1]]","v":"-"},{"$f":"lcc[[#This Row],[_1]]","v":"-"},{"$f":"lcc[[#This Row],[_2]]","v":"-"}]
["variable","ESCC",{"$f":"lcc[[#This Row],[doe]]","v":"0-50"},{"$f":"lcc[[#This Row],[max er]]","v":"0-50"},{"$f":"lcc[[#This Row],[Column1]]","v":"-"},{"$f":"lcc[[#This Row],[_1]]","v":"-"},{"$f":"lcc[[#This Row],[_2]]","v":"-"}]
["variable","ESCC",{"$f":"lcc[[#This Row],[doe]]","v":"0-50"},{"$f":"lcc[[#This Row],[max er]]","v":"50-100"},{"$f":"lcc[[#This Row],[Column1]]","v":55},{"$f":"lcc[[#This Row],[_1]]","v":55},{"$f":"lcc[[#This Row],[_2]]","v":55}]
["variable","ESCC",{"$f":"lcc[[#This Row],[doe]]","v":"0-50"},{"$f":"lcc[[#This Row],[max er]]","v":"100+"},{"$f":"lcc[[#This Row],[Column1]]","v":48},{"$f":"lcc[[#This Row],[_1]]","v":54},{"$f":"lcc[[#This Row],[_2]]","v":57}]
["variable","ESCC",{"$f":"lcc[[#This Row],[doe]]","v":"50-100"},{"$f":"lcc[[#This Row],[max er]]","v":"0-50"},{"$f":"lcc[[#This Row],[Column1]]","v":39},{"$f":"lcc[[#This Row],[_1]]","v":47},{"$f":"lcc[[#This Row],[_2]]","v":52}]
["variable","ESCC",{"$f":"lcc[[#This Row],[doe]]","v":"50-100"},{"$f":"lcc[[#This Row],[max er]]","v":"50-100"},{"$f":"lcc[[#This Row],[Column1]]","v":49},{"$f":"lcc[[#This Row],[_1]]","v":53},{"$f":"lcc[[#This Row],[_2]]","v":57}]
["variable","ESCC",{"$f":"lcc[[#This Row],[doe]]","v":"50-100"},{"$f":"lcc[[#This Row],[max er]]","v":"100+"},{"$f":"lcc[[#This Row],[Column1]]","v":47},{"$f":"lcc[[#This Row],[_1]]","v":51},{"$f":"lcc[[#This Row],[_2]]","v":55}]
["variable","ESCC",{"$f":"lcc[[#This Row],[doe]]","v":"100-150"},{"$f":"lcc[[#This Row],[max er]]","v":"0-50"},{"$f":"lcc[[#This Row],[Column1]]","v":47},{"$f":"lcc[[#This Row],[_1]]","v":50},{"$f":"lcc[[#This Row],[_2]]","v":53}]
["variable","ESCC",{"$f":"lcc[[#This Row],[doe]]","v":"100-150"},{"$f":"lcc[[#This Row],[max er]]","v":"50-100"},{"$f":"lcc[[#This Row],[Column1]]","v":47},{"$f":"lcc[[#This Row],[_1]]","v":52},{"$f":"lcc[[#This Row],[_2]]","v":57}]
["variable","ESCC",{"$f":"lcc[[#This Row],[doe]]","v":"100-150"},{"$f":"lcc[[#This Row],[max er]]","v":"100+"},{"$f":"lcc[[#This Row],[Column1]]","v":49},{"$f":"lcc[[#This Row],[_1]]","v":54},{"$f":"lcc[[#This Row],[_2]]","v":60}]
["variable","ESCC",{"$f":"lcc[[#This Row],[doe]]","v":"150-200"},{"$f":"lcc[[#This Row],[max er]]","v":"0-50"},{"$f":"lcc[[#This Row],[Column1]]","v":43},{"$f":"lcc[[#This Row],[_1]]","v":49},{"$f":"lcc[[#This Row],[_2]]","v":55}]
["variable","ESCC",{"$f":"lcc[[#This Row],[doe]]","v":"150-200"},{"$f":"lcc[[#This Row],[max er]]","v":"50-100"},{"$f":"lcc[[#This Row],[Column1]]","v":47},{"$f":"lcc[[#This Row],[_1]]","v":51},{"$f":"lcc[[#This Row],[_2]]","v":56}]
["variable","ESCC",{"$f":"lcc[[#This Row],[doe]]","v":"150-200"},{"$f":"lcc[[#This Row],[max er]]","v":"100+"},{"$f":"lcc[[#This Row],[Column1]]","v":47},{"$f":"lcc[[#This Row],[_1]]","v":53},{"$f":"lcc[[#This Row],[_2]]","v":59}]
["variable","ESCC",{"$f":"lcc[[#This Row],[doe]]","v":"200-300"},{"$f":"lcc[[#This Row],[max er]]","v":"0-50"},{"$f":"lcc[[#This Row],[Column1]]","v":47},{"$f":"lcc[[#This Row],[_1]]","v":50},{"$f":"lcc[[#This Row],[_2]]","v":54}]
["variable","ESCC",{"$f":"lcc[[#This Row],[doe]]","v":"200-300"},{"$f":"lcc[[#This Row],[max er]]","v":"50-100"},{"$f":"lcc[[#This Row],[Column1]]","v":42},{"$f":"lcc[[#This Row],[_1]]","v":54},{"$f":"lcc[[#This Row],[_2]]","v":57}]
["variable","ESCC",{"$f":"lcc[[#This Row],[doe]]","v":"200-300"},{"$f":"lcc[[#This Row],[max er]]","v":"100+"},{"$f":"lcc[[#This Row],[Column1]]","v":49},{"$f":"lcc[[#This Row],[_1]]","v":54},{"$f":"lcc[[#This Row],[_2]]","v":58}]
["variable","ESCC",{"$f":"lcc[[#This Row],[doe]]","v":"300-800"},{"$f":"lcc[[#This Row],[max er]]","v":"0-50"},{"$f":"lcc[[#This Row],[Column1]]","v":48},{"$f":"lcc[[#This Row],[_1]]","v":53},{"$f":"lcc[[#This Row],[_2]]","v":55}]
["variable","ESCC",{"$f":"lcc[[#This Row],[doe]]","v":"300-800"},{"$f":"lcc[[#This Row],[max er]]","v":"50-100"},{"$f":"lcc[[#This Row],[Column1]]","v":51},{"$f":"lcc[[#This Row],[_1]]","v":53},{"$f":"lcc[[#This Row],[_2]]","v":55}]
["variable","ESCC",{"$f":"lcc[[#This Row],[doe]]","v":"300-800"},{"$f":"lcc[[#This Row],[max er]]","v":"100+"},{"$f":"lcc[[#This Row],[Column1]]","v":49},{"$f":"lcc[[#This Row],[_1]]","v":53},{"$f":"lcc[[#This Row],[_2]]","v":57}]
["variable","ESCC",{"$f":"lcc[[#This Row],[doe]]","v":"800+"},{"$f":"lcc[[#This Row],[max er]]","v":"0-50"},{"$f":"lcc[[#This Row],[Column1]]","v":"-"},{"$f":"lcc[[#This Row],[_1]]","v":"-"},{"$f":"lcc[[#This Row],[_2]]","v":"-"}]
["variable","ESCC",{"$f":"lcc[[#This Row],[doe]]","v":"800+"},{"$f":"lcc[[#This Row],[max er]]","v":"50-100"},{"$f":"lcc[[#This Row],[Column1]]","v":51},{"$f":"lcc[[#This Row],[_1]]","v":54},{"$f":"lcc[[#This Row],[_2]]","v":55}]
["variable","ESCC",{"$f":"lcc[[#This Row],[doe]]","v":"800+"},{"$f":"lcc[[#This Row],[max er]]","v":"100+"},{"$f":"lcc[[#This Row],[Column1]]","v":48},{"$f":"lcc[[#This Row],[_1]]","v":52},{"$f":"lcc[[#This Row],[_2]]","v":56}]
["variable","ESFM",{"$f":"lcc[[#This Row],[doe]]","v":"0-50"},{"$f":"lcc[[#This Row],[max er]]","v":"0-50"},{"$f":"lcc[[#This Row],[Column1]]","v":34},{"$f":"lcc[[#This Row],[_1]]","v":34},{"$f":"lcc[[#This Row],[_2]]","v":34}]
["variable","ESFM",{"$f":"lcc[[#This Row],[doe]]","v":"0-50"},{"$f":"lcc[[#This Row],[max er]]","v":"50-100"},{"$f":"lcc[[#This Row],[Column1]]","v":56},{"$f":"lcc[[#This Row],[_1]]","v":56},{"$f":"lcc[[#This Row],[_2]]","v":56}]
["variable","ESFM",{"$f":"lcc[[#This Row],[doe]]","v":"0-50"},{"$f":"lcc[[#This Row],[max er]]","v":"100+"},{"$f":"lcc[[#This Row],[Column1]]","v":57},{"$f":"lcc[[#This Row],[_1]]","v":57},{"$f":"lcc[[#This Row],[_2]]","v":57}]
["variable","ESFM",{"$f":"lcc[[#This Row],[doe]]","v":"50-100"},{"$f":"lcc[[#This Row],[max er]]","v":"0-50"},{"$f":"lcc[[#This Row],[Column1]]","v":39},{"$f":"lcc[[#This Row],[_1]]","v":46},{"$f":"lcc[[#This Row],[_2]]","v":52}]
["variable","ESFM",{"$f":"lcc[[#This Row],[doe]]","v":"50-100"},{"$f":"lcc[[#This Row],[max er]]","v":"50-100"},{"$f":"lcc[[#This Row],[Column1]]","v":48},{"$f":"lcc[[#This Row],[_1]]","v":55},{"$f":"lcc[[#This Row],[_2]]","v":59}]
["variable","ESFM",{"$f":"lcc[[#This Row],[doe]]","v":"50-100"},{"$f":"lcc[[#This Row],[max er]]","v":"100+"},{"$f":"lcc[[#This Row],[Column1]]","v":44},{"$f":"lcc[[#This Row],[_1]]","v":50},{"$f":"lcc[[#This Row],[_2]]","v":56}]
["variable","ESFM",{"$f":"lcc[[#This Row],[doe]]","v":"100-150"},{"$f":"lcc[[#This Row],[max er]]","v":"0-50"},{"$f":"lcc[[#This Row],[Column1]]","v":41},{"$f":"lcc[[#This Row],[_1]]","v":50},{"$f":"lcc[[#This Row],[_2]]","v":54}]
["variable","ESFM",{"$f":"lcc[[#This Row],[doe]]","v":"100-150"},{"$f":"lcc[[#This Row],[max er]]","v":"50-100"},{"$f":"lcc[[#This Row],[Column1]]","v":47},{"$f":"lcc[[#This Row],[_1]]","v":55},{"$f":"lcc[[#This Row],[_2]]","v":62}]
["variable","ESFM",{"$f":"lcc[[#This Row],[doe]]","v":"100-150"},{"$f":"lcc[[#This Row],[max er]]","v":"100+"},{"$f":"lcc[[#This Row],[Column1]]","v":49},{"$f":"lcc[[#This Row],[_1]]","v":58},{"$f":"lcc[[#This Row],[_2]]","v":64}]
["variable","ESFM",{"$f":"lcc[[#This Row],[doe]]","v":"150-200"},{"$f":"lcc[[#This Row],[max er]]","v":"0-50"},{"$f":"lcc[[#This Row],[Column1]]","v":43},{"$f":"lcc[[#This Row],[_1]]","v":53},{"$f":"lcc[[#This Row],[_2]]","v":59}]
["variable","ESFM",{"$f":"lcc[[#This Row],[doe]]","v":"150-200"},{"$f":"lcc[[#This Row],[max er]]","v":"50-100"},{"$f":"lcc[[#This Row],[Column1]]","v":48},{"$f":"lcc[[#This Row],[_1]]","v":57},{"$f":"lcc[[#This Row],[_2]]","v":62}]
["variable","ESFM",{"$f":"lcc[[#This Row],[doe]]","v":"150-200"},{"$f":"lcc[[#This Row],[max er]]","v":"100+"},{"$f":"lcc[[#This Row],[Column1]]","v":47},{"$f":"lcc[[#This Row],[_1]]","v":55},{"$f":"lcc[[#This Row],[_2]]","v":62}]
["variable","ESFM",{"$f":"lcc[[#This Row],[doe]]","v":"200-300"},{"$f":"lcc[[#This Row],[max er]]","v":"0-50"},{"$f":"lcc[[#This Row],[Column1]]","v":47},{"$f":"lcc[[#This Row],[_1]]","v":53},{"$f":"lcc[[#This Row],[_2]]","v":59}]
["variable","ESFM",{"$f":"lcc[[#This Row],[doe]]","v":"200-300"},{"$f":"lcc[[#This Row],[max er]]","v":"50-100"},{"$f":"lcc[[#This Row],[Column1]]","v":50},{"$f":"lcc[[#This Row],[_1]]","v":57},{"$f":"lcc[[#This Row],[_2]]","v":60}]
["variable","ESFM",{"$f":"lcc[[#This Row],[doe]]","v":"200-300"},{"$f":"lcc[[#This Row],[max er]]","v":"100+"},{"$f":"lcc[[#This Row],[Column1]]","v":47},{"$f":"lcc[[#This Row],[_1]]","v":55},{"$f":"lcc[[#This Row],[_2]]","v":61}]
["variable","ESFM",{"$f":"lcc[[#This Row],[doe]]","v":"300-800"},{"$f":"lcc[[#This Row],[max er]]","v":"0-50"},{"$f":"lcc[[#This Row],[Column1]]","v":48},{"$f":"lcc[[#This Row],[_1]]","v":54},{"$f":"lcc[[#This Row],[_2]]","v":59}]
["variable","ESFM",{"$f":"lcc[[#This Row],[doe]]","v":"300-800"},{"$f":"lcc[[#This Row],[max er]]","v":"50-100"},{"$f":"lcc[[#This Row],[Column1]]","v":51},{"$f":"lcc[[#This Row],[_1]]","v":54},{"$f":"lcc[[#This Row],[_2]]","v":57}]
["variable","ESFM",{"$f":"lcc[[#This Row],[doe]]","v":"300-800"},{"$f":"lcc[[#This Row],[max er]]","v":"100+"},{"$f":"lcc[[#This Row],[Column1]]","v":49},{"$f":"lcc[[#This Row],[_1]]","v":52},{"$f":"lcc[[#This Row],[_2]]","v":57}]
["variable","ESFM",{"$f":"lcc[[#This Row],[doe]]","v":"800+"},{"$f":"lcc[[#This Row],[max er]]","v":"0-50"},{"$f":"lcc[[#This Row],[Column1]]","v":"-"},{"$f":"lcc[[#This Row],[_1]]","v":"-"},{"$f":"lcc[[#This Row],[_2]]","v":"-"}]
["variable","ESFM",{"$f":"lcc[[#This Row],[doe]]","v":"800+"},{"$f":"lcc[[#This Row],[max er]]","v":"50-100"},{"$f":"lcc[[#This Row],[Column1]]","v":50},{"$f":"lcc[[#This Row],[_1]]","v":53},{"$f":"lcc[[#This Row],[_2]]","v":56}]
["variable","ESFM",{"$f":"lcc[[#This Row],[doe]]","v":"800+"},{"$f":"lcc[[#This Row],[max er]]","v":"100+"},{"$f":"lcc[[#This Row],[Column1]]","v":45},{"$f":"lcc[[#This Row],[_1]]","v":52},{"$f":"lcc[[#This Row],[_2]]","v":56}]
["variable","IL",{"$f":"lcc[[#This Row],[doe]]","v":"0-50"},{"$f":"lcc[[#This Row],[max er]]","v":"0-50"},{"$f":"lcc[[#This Row],[Column1]]","v":"-"},{"$f":"lcc[[#This Row],[_1]]","v":"-"},{"$f":"lcc[[#This Row],[_2]]","v":"-"}]
["variable","IL",{"$f":"lcc[[#This Row],[doe]]","v":"0-50"},{"$f":"lcc[[#This Row],[max er]]","v":"50-100"},{"$f":"lcc[[#This Row],[Column1]]","v":"-"},{"$f":"lcc[[#This Row],[_1]]","v":"-"},{"$f":"lcc[[#This Row],[_2]]","v":"-"}]
["variable","IL",{"$f":"lcc[[#This Row],[doe]]","v":"0-50"},{"$f":"lcc[[#This Row],[max er]]","v":"100+"},{"$f":"lcc[[#This Row],[Column1]]","v":"-"},{"$f":"lcc[[#This Row],[_1]]","v":"-"},{"$f":"lcc[[#This Row],[_2]]","v":"-"}]
["variable","IL",{"$f":"lcc[[#This Row],[doe]]","v":"50-100"},{"$f":"lcc[[#This Row],[max er]]","v":"0-50"},{"$f":"lcc[[#This Row],[Column1]]","v":38},{"$f":"lcc[[#This Row],[_1]]","v":48},{"$f":"lcc[[#This Row],[_2]]","v":61}]
["variable","IL",{"$f":"lcc[[#This Row],[doe]]","v":"50-100"},{"$f":"lcc[[#This Row],[max er]]","v":"50-100"},{"$f":"lcc[[#This Row],[Column1]]","v":46},{"$f":"lcc[[#This Row],[_1]]","v":51},{"$f":"lcc[[#This Row],[_2]]","v":59}]
["variable","IL",{"$f":"lcc[[#This Row],[doe]]","v":"50-100"},{"$f":"lcc[[#This Row],[max er]]","v":"100+"},{"$f":"lcc[[#This Row],[Column1]]","v":50},{"$f":"lcc[[#This Row],[_1]]","v":51},{"$f":"lcc[[#This Row],[_2]]","v":54}]
["variable","IL",{"$f":"lcc[[#This Row],[doe]]","v":"100-150"},{"$f":"lcc[[#This Row],[max er]]","v":"0-50"},{"$f":"lcc[[#This Row],[Column1]]","v":44},{"$f":"lcc[[#This Row],[_1]]","v":58},{"$f":"lcc[[#This Row],[_2]]","v":64}]
["variable","IL",{"$f":"lcc[[#This Row],[doe]]","v":"100-150"},{"$f":"lcc[[#This Row],[max er]]","v":"50-100"},{"$f":"lcc[[#This Row],[Column1]]","v":48},{"$f":"lcc[[#This Row],[_1]]","v":51},{"$f":"lcc[[#This Row],[_2]]","v":58}]
["variable","IL",{"$f":"lcc[[#This Row],[doe]]","v":"100-150"},{"$f":"lcc[[#This Row],[max er]]","v":"100+"},{"$f":"lcc[[#This Row],[Column1]]","v":49},{"$f":"lcc[[#This Row],[_1]]","v":54},{"$f":"lcc[[#This Row],[_2]]","v":61}]
["variable","IL",{"$f":"lcc[[#This Row],[doe]]","v":"150-200"},{"$f":"lcc[[#This Row],[max er]]","v":"0-50"},{"$f":"lcc[[#This Row],[Column1]]","v":48},{"$f":"lcc[[#This Row],[_1]]","v":50},{"$f":"lcc[[#This Row],[_2]]","v":56}]
["variable","IL",{"$f":"lcc[[#This Row],[doe]]","v":"150-200"},{"$f":"lcc[[#This Row],[max er]]","v":"50-100"},{"$f":"lcc[[#This Row],[Column1]]","v":47},{"$f":"lcc[[#This Row],[_1]]","v":55},{"$f":"lcc[[#This Row],[_2]]","v":59}]
["variable","IL",{"$f":"lcc[[#This Row],[doe]]","v":"150-200"},{"$f":"lcc[[#This Row],[max er]]","v":"100+"},{"$f":"lcc[[#This Row],[Column1]]","v":49},{"$f":"lcc[[#This Row],[_1]]","v":53},{"$f":"lcc[[#This Row],[_2]]","v":60}]
["variable","IL",{"$f":"lcc[[#This Row],[doe]]","v":"200-300"},{"$f":"lcc[[#This Row],[max er]]","v":"0-50"},{"$f":"lcc[[#This Row],[Column1]]","v":46},{"$f":"lcc[[#This Row],[_1]]","v":56},{"$f":"lcc[[#This Row],[_2]]","v":64}]
["variable","IL",{"$f":"lcc[[#This Row],[doe]]","v":"200-300"},{"$f":"lcc[[#This Row],[max er]]","v":"50-100"},{"$f":"lcc[[#This Row],[Column1]]","v":44},{"$f":"lcc[[#This Row],[_1]]","v":53},{"$f":"lcc[[#This Row],[_2]]","v":58}]
["variable","IL",{"$f":"lcc[[#This Row],[doe]]","v":"200-300"},{"$f":"lcc[[#This Row],[max er]]","v":"100+"},{"$f":"lcc[[#This Row],[Column1]]","v":49},{"$f":"lcc[[#This Row],[_1]]","v":53},{"$f":"lcc[[#This Row],[_2]]","v":59}]
["variable","IL",{"$f":"lcc[[#This Row],[doe]]","v":"300-800"},{"$f":"lcc[[#This Row],[max er]]","v":"0-50"},{"$f":"lcc[[#This Row],[Column1]]","v":43},{"$f":"lcc[[#This Row],[_1]]","v":50},{"$f":"lcc[[#This Row],[_2]]","v":57}]
["variable","IL",{"$f":"lcc[[#This Row],[doe]]","v":"300-800"},{"$f":"lcc[[#This Row],[max er]]","v":"50-100"},{"$f":"lcc[[#This Row],[Column1]]","v":50},{"$f":"lcc[[#This Row],[_1]]","v":52},{"$f":"lcc[[#This Row],[_2]]","v":57}]
["variable","IL",{"$f":"lcc[[#This Row],[doe]]","v":"300-800"},{"$f":"lcc[[#This Row],[max er]]","v":"100+"},{"$f":"lcc[[#This Row],[Column1]]","v":48},{"$f":"lcc[[#This Row],[_1]]","v":52},{"$f":"lcc[[#This Row],[_2]]","v":60}]
["variable","IL",{"$f":"lcc[[#This Row],[doe]]","v":"800+"},{"$f":"lcc[[#This Row],[max er]]","v":"0-50"},{"$f":"lcc[[#This Row],[Column1]]","v":53},{"$f":"lcc[[#This Row],[_1]]","v":53},{"$f":"lcc[[#This Row],[_2]]","v":53}]
["variable","IL",{"$f":"lcc[[#This Row],[doe]]","v":"800+"},{"$f":"lcc[[#This Row],[max er]]","v":"50-100"},{"$f":"lcc[[#This Row],[Column1]]","v":50},{"$f":"lcc[[#This Row],[_1]]","v":52},{"$f":"lcc[[#This Row],[_2]]","v":54}]
["variable","IL",{"$f":"lcc[[#This Row],[doe]]","v":"800+"},{"$f":"lcc[[#This Row],[max er]]","v":"100+"},{"$f":"lcc[[#This Row],[Column1]]","v":49},{"$f":"lcc[[#This Row],[_1]]","v":52},{"$f":"lcc[[#This Row],[_2]]","v":56}]
["variable","RSV",{"$f":"lcc[[#This Row],[doe]]","v":"0-50"},{"$f":"lcc[[#This Row],[max er]]","v":"0-50"},{"$f":"lcc[[#This Row],[Column1]]","v":57},{"$f":"lcc[[#This Row],[_1]]","v":57},{"$f":"lcc[[#This Row],[_2]]","v":57}]
["variable","RSV",{"$f":"lcc[[#This Row],[doe]]","v":"0-50"},{"$f":"lcc[[#This Row],[max er]]","v":"50-100"},{"$f":"lcc[[#This Row],[Column1]]","v":46},{"$f":"lcc[[#This Row],[_1]]","v":55},{"$f":"lcc[[#This Row],[_2]]","v":61}]
["variable","RSV",{"$f":"lcc[[#This Row],[doe]]","v":"0-50"},{"$f":"lcc[[#This Row],[max er]]","v":"100+"},{"$f":"lcc[[#This Row],[Column1]]","v":50},{"$f":"lcc[[#This Row],[_1]]","v":58},{"$f":"lcc[[#This Row],[_2]]","v":59}]
["variable","RSV",{"$f":"lcc[[#This Row],[doe]]","v":"50-100"},{"$f":"lcc[[#This Row],[max er]]","v":"0-50"},{"$f":"lcc[[#This Row],[Column1]]","v":50},{"$f":"lcc[[#This Row],[_1]]","v":57},{"$f":"lcc[[#This Row],[_2]]","v":59}]
["variable","RSV",{"$f":"lcc[[#This Row],[doe]]","v":"50-100"},{"$f":"lcc[[#This Row],[max er]]","v":"50-100"},{"$f":"lcc[[#This Row],[Column1]]","v":49},{"$f":"lcc[[#This Row],[_1]]","v":57},{"$f":"lcc[[#This Row],[_2]]","v":62}]
["variable","RSV",{"$f":"lcc[[#This Row],[doe]]","v":"50-100"},{"$f":"lcc[[#This Row],[max er]]","v":"100+"},{"$f":"lcc[[#This Row],[Column1]]","v":50},{"$f":"lcc[[#This Row],[_1]]","v":57},{"$f":"lcc[[#This Row],[_2]]","v":60}]
["variable","RSV",{"$f":"lcc[[#This Row],[doe]]","v":"100-150"},{"$f":"lcc[[#This Row],[max er]]","v":"0-50"},{"$f":"lcc[[#This Row],[Column1]]","v":"-"},{"$f":"lcc[[#This Row],[_1]]","v":"-"},{"$f":"lcc[[#This Row],[_2]]","v":"-"}]
["variable","RSV",{"$f":"lcc[[#This Row],[doe]]","v":"100-150"},{"$f":"lcc[[#This Row],[max er]]","v":"50-100"},{"$f":"lcc[[#This Row],[Column1]]","v":53},{"$f":"lcc[[#This Row],[_1]]","v":54},{"$f":"lcc[[#This Row],[_2]]","v":54}]
["variable","RSV",{"$f":"lcc[[#This Row],[doe]]","v":"100-150"},{"$f":"lcc[[#This Row],[max er]]","v":"100+"},{"$f":"lcc[[#This Row],[Column1]]","v":51},{"$f":"lcc[[#This Row],[_1]]","v":56},{"$f":"lcc[[#This Row],[_2]]","v":59}]
["variable","RSV",{"$f":"lcc[[#This Row],[doe]]","v":"150-200"},{"$f":"lcc[[#This Row],[max er]]","v":"0-50"},{"$f":"lcc[[#This Row],[Column1]]","v":"-"},{"$f":"lcc[[#This Row],[_1]]","v":"-"},{"$f":"lcc[[#This Row],[_2]]","v":"-"}]
["variable","RSV",{"$f":"lcc[[#This Row],[doe]]","v":"150-200"},{"$f":"lcc[[#This Row],[max er]]","v":"50-100"},{"$f":"lcc[[#This Row],[Column1]]","v":50},{"$f":"lcc[[#This Row],[_1]]","v":52},{"$f":"lcc[[#This Row],[_2]]","v":55}]
["variable","RSV",{"$f":"lcc[[#This Row],[doe]]","v":"150-200"},{"$f":"lcc[[#This Row],[max er]]","v":"100+"},{"$f":"lcc[[#This Row],[Column1]]","v":54},{"$f":"lcc[[#This Row],[_1]]","v":58},{"$f":"lcc[[#This Row],[_2]]","v":60}]
["variable","RSV",{"$f":"lcc[[#This Row],[doe]]","v":"200-300"},{"$f":"lcc[[#This Row],[max er]]","v":"0-50"},{"$f":"lcc[[#This Row],[Column1]]","v":"-"},{"$f":"lcc[[#This Row],[_1]]","v":"-"},{"$f":"lcc[[#This Row],[_2]]","v":"-"}]
["variable","RSV",{"$f":"lcc[[#This Row],[doe]]","v":"200-300"},{"$f":"lcc[[#This Row],[max er]]","v":"50-100"},{"$f":"lcc[[#This Row],[Column1]]","v":50},{"$f":"lcc[[#This Row],[_1]]","v":55},{"$f":"lcc[[#This Row],[_2]]","v":59}]
["variable","RSV",{"$f":"lcc[[#This Row],[doe]]","v":"200-300"},{"$f":"lcc[[#This Row],[max er]]","v":"100+"},{"$f":"lcc[[#This Row],[Column1]]","v":54},{"$f":"lcc[[#This Row],[_1]]","v":56},{"$f":"lcc[[#This Row],[_2]]","v":60}]
["variable","RSV",{"$f":"lcc[[#This Row],[doe]]","v":"300-800"},{"$f":"lcc[[#This Row],[max er]]","v":"0-50"},{"$f":"lcc[[#This Row],[Column1]]","v":"-"},{"$f":"lcc[[#This Row],[_1]]","v":"-"},{"$f":"lcc[[#This Row],[_2]]","v":"-"}]
["variable","RSV",{"$f":"lcc[[#This Row],[doe]]","v":"300-800"},{"$f":"lcc[[#This Row],[max er]]","v":"50-100"},{"$f":"lcc[[#This Row],[Column1]]","v":53},{"$f":"lcc[[#This Row],[_1]]","v":57},{"$f":"lcc[[#This Row],[_2]]","v":58}]
["variable","RSV",{"$f":"lcc[[#This Row],[doe]]","v":"300-800"},{"$f":"lcc[[#This Row],[max er]]","v":"100+"},{"$f":"lcc[[#This Row],[Column1]]","v":41},{"$f":"lcc[[#This Row],[_1]]","v":51},{"$f":"lcc[[#This Row],[_2]]","v":57}]
["variable","RSV",{"$f":"lcc[[#This Row],[doe]]","v":"800+"},{"$f":"lcc[[#This Row],[max er]]","v":"0-50"},{"$f":"lcc[[#This Row],[Column1]]","v":"-"},{"$f":"lcc[[#This Row],[_1]]","v":"-"},{"$f":"lcc[[#This Row],[_2]]","v":"-"}]
["variable","RSV",{"$f":"lcc[[#This Row],[doe]]","v":"800+"},{"$f":"lcc[[#This Row],[max er]]","v":"50-100"},{"$f":"lcc[[#This Row],[Column1]]","v":"-"},{"$f":"lcc[[#This Row],[_1]]","v":"-"},{"$f":"lcc[[#This Row],[_2]]","v":"-"}]
["variable","RSV",{"$f":"lcc[[#This Row],[doe]]","v":"800+"},{"$f":"lcc[[#This Row],[max er]]","v":"100+"},{"$f":"lcc[[#This Row],[Column1]]","v":"-"},{"$f":"lcc[[#This Row],[_1]]","v":"-"},{"$f":"lcc[[#This Row],[_2]]","v":"-"}]
["variable","ST",{"$f":"lcc[[#This Row],[doe]]","v":"0-50"},{"$f":"lcc[[#This Row],[max er]]","v":"0-50"},{"$f":"lcc[[#This Row],[Column1]]","v":"-"},{"$f":"lcc[[#This Row],[_1]]","v":"-"},{"$f":"lcc[[#This Row],[_2]]","v":"-"}]
["variable","ST",{"$f":"lcc[[#This Row],[doe]]","v":"0-50"},{"$f":"lcc[[#This Row],[max er]]","v":"50-100"},{"$f":"lcc[[#This Row],[Column1]]","v":"-"},{"$f":"lcc[[#This Row],[_1]]","v":"-"},{"$f":"lcc[[#This Row],[_2]]","v":"-"}]
["variable","ST",{"$f":"lcc[[#This Row],[doe]]","v":"0-50"},{"$f":"lcc[[#This Row],[max er]]","v":"100+"},{"$f":"lcc[[#This Row],[Column1]]","v":41},{"$f":"lcc[[#This Row],[_1]]","v":46},{"$f":"lcc[[#This Row],[_2]]","v":51}]
["variable","ST",{"$f":"lcc[[#This Row],[doe]]","v":"50-100"},{"$f":"lcc[[#This Row],[max er]]","v":"0-50"},{"$f":"lcc[[#This Row],[Column1]]","v":"-"},{"$f":"lcc[[#This Row],[_1]]","v":"-"},{"$f":"lcc[[#This Row],[_2]]","v":"-"}]
["variable","ST",{"$f":"lcc[[#This Row],[doe]]","v":"50-100"},{"$f":"lcc[[#This Row],[max er]]","v":"50-100"},{"$f":"lcc[[#This Row],[Column1]]","v":"-"},{"$f":"lcc[[#This Row],[_1]]","v":"-"},{"$f":"lcc[[#This Row],[_2]]","v":"-"}]
["variable","ST",{"$f":"lcc[[#This Row],[doe]]","v":"50-100"},{"$f":"lcc[[#This Row],[max er]]","v":"100+"},{"$f":"lcc[[#This Row],[Column1]]","v":42},{"$f":"lcc[[#This Row],[_1]]","v":44},{"$f":"lcc[[#This Row],[_2]]","v":48}]
["variable","ST",{"$f":"lcc[[#This Row],[doe]]","v":"100-150"},{"$f":"lcc[[#This Row],[max er]]","v":"0-50"},{"$f":"lcc[[#This Row],[Column1]]","v":"-"},{"$f":"lcc[[#This Row],[_1]]","v":"-"},{"$f":"lcc[[#This Row],[_2]]","v":"-"}]
["variable","ST",{"$f":"lcc[[#This Row],[doe]]","v":"100-150"},{"$f":"lcc[[#This Row],[max er]]","v":"50-100"},{"$f":"lcc[[#This Row],[Column1]]","v":"-"},{"$f":"lcc[[#This Row],[_1]]","v":"-"},{"$f":"lcc[[#This Row],[_2]]","v":"-"}]
["variable","ST",{"$f":"lcc[[#This Row],[doe]]","v":"100-150"},{"$f":"lcc[[#This Row],[max er]]","v":"100+"},{"$f":"lcc[[#This Row],[Column1]]","v":42},{"$f":"lcc[[#This Row],[_1]]","v":42},{"$f":"lcc[[#This Row],[_2]]","v":42}]
["variable","ST",{"$f":"lcc[[#This Row],[doe]]","v":"150-200"},{"$f":"lcc[[#This Row],[max er]]","v":"0-50"},{"$f":"lcc[[#This Row],[Column1]]","v":"-"},{"$f":"lcc[[#This Row],[_1]]","v":"-"},{"$f":"lcc[[#This Row],[_2]]","v":"-"}]
["variable","ST",{"$f":"lcc[[#This Row],[doe]]","v":"150-200"},{"$f":"lcc[[#This Row],[max er]]","v":"50-100"},{"$f":"lcc[[#This Row],[Column1]]","v":"-"},{"$f":"lcc[[#This Row],[_1]]","v":"-"},{"$f":"lcc[[#This Row],[_2]]","v":"-"}]
["variable","ST",{"$f":"lcc[[#This Row],[doe]]","v":"150-200"},{"$f":"lcc[[#This Row],[max er]]","v":"100+"},{"$f":"lcc[[#This Row],[Column1]]","v":42},{"$f":"lcc[[#This Row],[_1]]","v":44},{"$f":"lcc[[#This Row],[_2]]","v":45}]
["variable","ST",{"$f":"lcc[[#This Row],[doe]]","v":"200-300"},{"$f":"lcc[[#This Row],[max er]]","v":"0-50"},{"$f":"lcc[[#This Row],[Column1]]","v":"-"},{"$f":"lcc[[#This Row],[_1]]","v":"-"},{"$f":"lcc[[#This Row],[_2]]","v":"-"}]
["variable","ST",{"$f":"lcc[[#This Row],[doe]]","v":"200-300"},{"$f":"lcc[[#This Row],[max er]]","v":"50-100"},{"$f":"lcc[[#This Row],[Column1]]","v":"-"},{"$f":"lcc[[#This Row],[_1]]","v":"-"},{"$f":"lcc[[#This Row],[_2]]","v":"-"}]
["variable","ST",{"$f":"lcc[[#This Row],[doe]]","v":"200-300"},{"$f":"lcc[[#This Row],[max er]]","v":"100+"},{"$f":"lcc[[#This Row],[Column1]]","v":44},{"$f":"lcc[[#This Row],[_1]]","v":45},{"$f":"lcc[[#This Row],[_2]]","v":46}]
["variable","ST",{"$f":"lcc[[#This Row],[doe]]","v":"300-800"},{"$f":"lcc[[#This Row],[max er]]","v":"0-50"},{"$f":"lcc[[#This Row],[Column1]]","v":"-"},{"$f":"lcc[[#This Row],[_1]]","v":"-"},{"$f":"lcc[[#This Row],[_2]]","v":"-"}]
["variable","ST",{"$f":"lcc[[#This Row],[doe]]","v":"300-800"},{"$f":"lcc[[#This Row],[max er]]","v":"50-100"},{"$f":"lcc[[#This Row],[Column1]]","v":"-"},{"$f":"lcc[[#This Row],[_1]]","v":"-"},{"$f":"lcc[[#This Row],[_2]]","v":"-"}]
["variable","ST",{"$f":"lcc[[#This Row],[doe]]","v":"300-800"},{"$f":"lcc[[#This Row],[max er]]","v":"100+"},{"$f":"lcc[[#This Row],[Column1]]","v":46},{"$f":"lcc[[#This Row],[_1]]","v":47},{"$f":"lcc[[#This Row],[_2]]","v":47}]
["variable","ST",{"$f":"lcc[[#This Row],[doe]]","v":"800+"},{"$f":"lcc[[#This Row],[max er]]","v":"0-50"},{"$f":"lcc[[#This Row],[Column1]]","v":"-"},{"$f":"lcc[[#This Row],[_1]]","v":"-"},{"$f":"lcc[[#This Row],[_2]]","v":"-"}]
["variable","ST",{"$f":"lcc[[#This Row],[doe]]","v":"800+"},{"$f":"lcc[[#This Row],[max er]]","v":"50-100"},{"$f":"lcc[[#This Row],[Column1]]","v":"-"},{"$f":"lcc[[#This Row],[_1]]","v":"-"},{"$f":"lcc[[#This Row],[_2]]","v":"-"}]
["variable","ST",{"$f":"lcc[[#This Row],[doe]]","v":"800+"},{"$f":"lcc[[#This Row],[max er]]","v":"100+"},{"$f":"lcc[[#This Row],[Column1]]","v":"-"},{"$f":"lcc[[#This Row],[_1]]","v":"-"},{"$f":"lcc[[#This Row],[_2]]","v":"-"}]
["constant","ESCC",{"$f":"lcc[[#This Row],[doe]]","v":"0-50"},{"$f":"lcc[[#This Row],[max er]]","v":"0-50"},{"$f":"lcc[[#This Row],[Column1]]","v":"-"},{"$f":"lcc[[#This Row],[_1]]","v":"-"},{"$f":"lcc[[#This Row],[_2]]","v":"-"}]
["constant","ESCC",{"$f":"lcc[[#This Row],[doe]]","v":"0-50"},{"$f":"lcc[[#This Row],[max er]]","v":"50-100"},{"$f":"lcc[[#This Row],[Column1]]","v":"-"},{"$f":"lcc[[#This Row],[_1]]","v":"-"},{"$f":"lcc[[#This Row],[_2]]","v":"-"}]
["constant","ESCC",{"$f":"lcc[[#This Row],[doe]]","v":"0-50"},{"$f":"lcc[[#This Row],[max er]]","v":"100+"},{"$f":"lcc[[#This Row],[Column1]]","v":48},{"$f":"lcc[[#This Row],[_1]]","v":48},{"$f":"lcc[[#This Row],[_2]]","v":48}]
["constant","ESCC",{"$f":"lcc[[#This Row],[doe]]","v":"50-100"},{"$f":"lcc[[#This Row],[max er]]","v":"0-50"},{"$f":"lcc[[#This Row],[Column1]]","v":"-"},{"$f":"lcc[[#This Row],[_1]]","v":"-"},{"$f":"lcc[[#This Row],[_2]]","v":"-"}]
["constant","ESCC",{"$f":"lcc[[#This Row],[doe]]","v":"50-100"},{"$f":"lcc[[#This Row],[max er]]","v":"50-100"},{"$f":"lcc[[#This Row],[Column1]]","v":"-"},{"$f":"lcc[[#This Row],[_1]]","v":"-"},{"$f":"lcc[[#This Row],[_2]]","v":"-"}]
["constant","ESCC",{"$f":"lcc[[#This Row],[doe]]","v":"50-100"},{"$f":"lcc[[#This Row],[max er]]","v":"100+"},{"$f":"lcc[[#This Row],[Column1]]","v":"-"},{"$f":"lcc[[#This Row],[_1]]","v":"-"},{"$f":"lcc[[#This Row],[_2]]","v":"-"}]
["constant","ESCC",{"$f":"lcc[[#This Row],[doe]]","v":"100-150"},{"$f":"lcc[[#This Row],[max er]]","v":"0-50"},{"$f":"lcc[[#This Row],[Column1]]","v":"-"},{"$f":"lcc[[#This Row],[_1]]","v":"-"},{"$f":"lcc[[#This Row],[_2]]","v":"-"}]
["constant","ESCC",{"$f":"lcc[[#This Row],[doe]]","v":"100-150"},{"$f":"lcc[[#This Row],[max er]]","v":"50-100"},{"$f":"lcc[[#This Row],[Column1]]","v":"-"},{"$f":"lcc[[#This Row],[_1]]","v":"-"},{"$f":"lcc[[#This Row],[_2]]","v":"-"}]
["constant","ESCC",{"$f":"lcc[[#This Row],[doe]]","v":"100-150"},{"$f":"lcc[[#This Row],[max er]]","v":"100+"},{"$f":"lcc[[#This Row],[Column1]]","v":"-"},{"$f":"lcc[[#This Row],[_1]]","v":"-"},{"$f":"lcc[[#This Row],[_2]]","v":"-"}]
["constant","ESCC",{"$f":"lcc[[#This Row],[doe]]","v":"150-200"},{"$f":"lcc[[#This Row],[max er]]","v":"0-50"},{"$f":"lcc[[#This Row],[Column1]]","v":"-"},{"$f":"lcc[[#This Row],[_1]]","v":"-"},{"$f":"lcc[[#This Row],[_2]]","v":"-"}]
["constant","ESCC",{"$f":"lcc[[#This Row],[doe]]","v":"150-200"},{"$f":"lcc[[#This Row],[max er]]","v":"50-100"},{"$f":"lcc[[#This Row],[Column1]]","v":"-"},{"$f":"lcc[[#This Row],[_1]]","v":"-"},{"$f":"lcc[[#This Row],[_2]]","v":"-"}]
["constant","ESCC",{"$f":"lcc[[#This Row],[doe]]","v":"150-200"},{"$f":"lcc[[#This Row],[max er]]","v":"100+"},{"$f":"lcc[[#This Row],[Column1]]","v":"-"},{"$f":"lcc[[#This Row],[_1]]","v":"-"},{"$f":"lcc[[#This Row],[_2]]","v":"-"}]
["constant","ESCC",{"$f":"lcc[[#This Row],[doe]]","v":"200-300"},{"$f":"lcc[[#This Row],[max er]]","v":"0-50"},{"$f":"lcc[[#This Row],[Column1]]","v":"-"},{"$f":"lcc[[#This Row],[_1]]","v":"-"},{"$f":"lcc[[#This Row],[_2]]","v":"-"}]
["constant","ESCC",{"$f":"lcc[[#This Row],[doe]]","v":"200-300"},{"$f":"lcc[[#This Row],[max er]]","v":"50-100"},{"$f":"lcc[[#This Row],[Column1]]","v":"-"},{"$f":"lcc[[#This Row],[_1]]","v":"-"},{"$f":"lcc[[#This Row],[_2]]","v":"-"}]
["constant","ESCC",{"$f":"lcc[[#This Row],[doe]]","v":"200-300"},{"$f":"lcc[[#This Row],[max er]]","v":"100+"},{"$f":"lcc[[#This Row],[Column1]]","v":"-"},{"$f":"lcc[[#This Row],[_1]]","v":"-"},{"$f":"lcc[[#This Row],[_2]]","v":"-"}]
["constant","ESCC",{"$f":"lcc[[#This Row],[doe]]","v":"300-800"},{"$f":"lcc[[#This Row],[max er]]","v":"0-50"},{"$f":"lcc[[#This Row],[Column1]]","v":"-"},{"$f":"lcc[[#This Row],[_1]]","v":"-"},{"$f":"lcc[[#This Row],[_2]]","v":"-"}]
["constant","ESCC",{"$f":"lcc[[#This Row],[doe]]","v":"300-800"},{"$f":"lcc[[#This Row],[max er]]","v":"50-100"},{"$f":"lcc[[#This Row],[Column1]]","v":"-"},{"$f":"lcc[[#This Row],[_1]]","v":"-"},{"$f":"lcc[[#This Row],[_2]]","v":"-"}]
["constant","ESCC",{"$f":"lcc[[#This Row],[doe]]","v":"300-800"},{"$f":"lcc[[#This Row],[max er]]","v":"100+"},{"$f":"lcc[[#This Row],[Column1]]","v":"-"},{"$f":"lcc[[#This Row],[_1]]","v":"-"},{"$f":"lcc[[#This Row],[_2]]","v":"-"}]
["constant","ESCC",{"$f":"lcc[[#This Row],[doe]]","v":"800+"},{"$f":"lcc[[#This Row],[max er]]","v":"0-50"},{"$f":"lcc[[#This Row],[Column1]]","v":"-"},{"$f":"lcc[[#This Row],[_1]]","v":"-"},{"$f":"lcc[[#This Row],[_2]]","v":"-"}]
["constant","ESCC",{"$f":"lcc[[#This Row],[doe]]","v":"800+"},{"$f":"lcc[[#This Row],[max er]]","v":"50-100"},{"$f":"lcc[[#This Row],[Column1]]","v":"-"},{"$f":"lcc[[#This Row],[_1]]","v":"-"},{"$f":"lcc[[#This Row],[_2]]","v":"-"}]
["constant","ESCC",{"$f":"lcc[[#This Row],[doe]]","v":"800+"},{"$f":"lcc[[#This Row],[max er]]","v":"100+"},{"$f":"lcc[[#This Row],[Column1]]","v":"-"},{"$f":"lcc[[#This Row],[_1]]","v":"-"},{"$f":"lcc[[#This Row],[_2]]","v":"-"}]
["constant","ESFM",{"$f":"lcc[[#This Row],[doe]]","v":"0-50"},{"$f":"lcc[[#This Row],[max er]]","v":"0-50"},{"$f":"lcc[[#This Row],[Column1]]","v":"-"},{"$f":"lcc[[#This Row],[_1]]","v":"-"},{"$f":"lcc[[#This Row],[_2]]","v":"-"}]
["constant","ESFM",{"$f":"lcc[[#This Row],[doe]]","v":"0-50"},{"$f":"lcc[[#This Row],[max er]]","v":"50-100"},{"$f":"lcc[[#This Row],[Column1]]","v":"-"},{"$f":"lcc[[#This Row],[_1]]","v":"-"},{"$f":"lcc[[#This Row],[_2]]","v":"-"}]
["constant","ESFM",{"$f":"lcc[[#This Row],[doe]]","v":"0-50"},{"$f":"lcc[[#This Row],[max er]]","v":"100+"},{"$f":"lcc[[#This Row],[Column1]]","v":48},{"$f":"lcc[[#This Row],[_1]]","v":48},{"$f":"lcc[[#This Row],[_2]]","v":48}]
["constant","ESFM",{"$f":"lcc[[#This Row],[doe]]","v":"50-100"},{"$f":"lcc[[#This Row],[max er]]","v":"0-50"},{"$f":"lcc[[#This Row],[Column1]]","v":"-"},{"$f":"lcc[[#This Row],[_1]]","v":"-"},{"$f":"lcc[[#This Row],[_2]]","v":"-"}]
["constant","ESFM",{"$f":"lcc[[#This Row],[doe]]","v":"50-100"},{"$f":"lcc[[#This Row],[max er]]","v":"50-100"},{"$f":"lcc[[#This Row],[Column1]]","v":"-"},{"$f":"lcc[[#This Row],[_1]]","v":"-"},{"$f":"lcc[[#This Row],[_2]]","v":"-"}]
["constant","ESFM",{"$f":"lcc[[#This Row],[doe]]","v":"50-100"},{"$f":"lcc[[#This Row],[max er]]","v":"100+"},{"$f":"lcc[[#This Row],[Column1]]","v":"-"},{"$f":"lcc[[#This Row],[_1]]","v":"-"},{"$f":"lcc[[#This Row],[_2]]","v":"-"}]
["constant","ESFM",{"$f":"lcc[[#This Row],[doe]]","v":"100-150"},{"$f":"lcc[[#This Row],[max er]]","v":"0-50"},{"$f":"lcc[[#This Row],[Column1]]","v":"-"},{"$f":"lcc[[#This Row],[_1]]","v":"-"},{"$f":"lcc[[#This Row],[_2]]","v":"-"}]
["constant","ESFM",{"$f":"lcc[[#This Row],[doe]]","v":"100-150"},{"$f":"lcc[[#This Row],[max er]]","v":"50-100"},{"$f":"lcc[[#This Row],[Column1]]","v":"-"},{"$f":"lcc[[#This Row],[_1]]","v":"-"},{"$f":"lcc[[#This Row],[_2]]","v":"-"}]
["constant","ESFM",{"$f":"lcc[[#This Row],[doe]]","v":"100-150"},{"$f":"lcc[[#This Row],[max er]]","v":"100+"},{"$f":"lcc[[#This Row],[Column1]]","v":"-"},{"$f":"lcc[[#This Row],[_1]]","v":"-"},{"$f":"lcc[[#This Row],[_2]]","v":"-"}]
["constant","ESFM",{"$f":"lcc[[#This Row],[doe]]","v":"150-200"},{"$f":"lcc[[#This Row],[max er]]","v":"0-50"},{"$f":"lcc[[#This Row],[Column1]]","v":"-"},{"$f":"lcc[[#This Row],[_1]]","v":"-"},{"$f":"lcc[[#This Row],[_2]]","v":"-"}]
["constant","ESFM",{"$f":"lcc[[#This Row],[doe]]","v":"150-200"},{"$f":"lcc[[#This Row],[max er]]","v":"50-100"},{"$f":"lcc[[#This Row],[Column1]]","v":"-"},{"$f":"lcc[[#This Row],[_1]]","v":"-"},{"$f":"lcc[[#This Row],[_2]]","v":"-"}]
["constant","ESFM",{"$f":"lcc[[#This Row],[doe]]","v":"150-200"},{"$f":"lcc[[#This Row],[max er]]","v":"100+"},{"$f":"lcc[[#This Row],[Column1]]","v":"-"},{"$f":"lcc[[#This Row],[_1]]","v":"-"},{"$f":"lcc[[#This Row],[_2]]","v":"-"}]
["constant","ESFM",{"$f":"lcc[[#This Row],[doe]]","v":"200-300"},{"$f":"lcc[[#This Row],[max er]]","v":"0-50"},{"$f":"lcc[[#This Row],[Column1]]","v":"-"},{"$f":"lcc[[#This Row],[_1]]","v":"-"},{"$f":"lcc[[#This Row],[_2]]","v":"-"}]
["constant","ESFM",{"$f":"lcc[[#This Row],[doe]]","v":"200-300"},{"$f":"lcc[[#This Row],[max er]]","v":"50-100"},{"$f":"lcc[[#This Row],[Column1]]","v":"-"},{"$f":"lcc[[#This Row],[_1]]","v":"-"},{"$f":"lcc[[#This Row],[_2]]","v":"-"}]
["constant","ESFM",{"$f":"lcc[[#This Row],[doe]]","v":"200-300"},{"$f":"lcc[[#This Row],[max er]]","v":"100+"},{"$f":"lcc[[#This Row],[Column1]]","v":"-"},{"$f":"lcc[[#This Row],[_1]]","v":"-"},{"$f":"lcc[[#This Row],[_2]]","v":"-"}]
["constant","ESFM",{"$f":"lcc[[#This Row],[doe]]","v":"300-800"},{"$f":"lcc[[#This Row],[max er]]","v":"0-50"},{"$f":"lcc[[#This Row],[Column1]]","v":"-"},{"$f":"lcc[[#This Row],[_1]]","v":"-"},{"$f":"lcc[[#This Row],[_2]]","v":"-"}]
["constant","ESFM",{"$f":"lcc[[#This Row],[doe]]","v":"300-800"},{"$f":"lcc[[#This Row],[max er]]","v":"50-100"},{"$f":"lcc[[#This Row],[Column1]]","v":"-"},{"$f":"lcc[[#This Row],[_1]]","v":"-"},{"$f":"lcc[[#This Row],[_2]]","v":"-"}]
["constant","ESFM",{"$f":"lcc[[#This Row],[doe]]","v":"300-800"},{"$f":"lcc[[#This Row],[max er]]","v":"100+"},{"$f":"lcc[[#This Row],[Column1]]","v":"-"},{"$f":"lcc[[#This Row],[_1]]","v":"-"},{"$f":"lcc[[#This Row],[_2]]","v":"-"}]
["constant","ESFM",{"$f":"lcc[[#This Row],[doe]]","v":"800+"},{"$f":"lcc[[#This Row],[max er]]","v":"0-50"},{"$f":"lcc[[#This Row],[Column1]]","v":"-"},{"$f":"lcc[[#This Row],[_1]]","v":"-"},{"$f":"lcc[[#This Row],[_2]]","v":"-"}]
["constant","ESFM",{"$f":"lcc[[#This Row],[doe]]","v":"800+"},{"$f":"lcc[[#This Row],[max er]]","v":"50-100"},{"$f":"lcc[[#This Row],[Column1]]","v":"-"},{"$f":"lcc[[#This Row],[_1]]","v":"-"},{"$f":"lcc[[#This Row],[_2]]","v":"-"}]
["constant","ESFM",{"$f":"lcc[[#This Row],[doe]]","v":"800+"},{"$f":"lcc[[#This Row],[max er]]","v":"100+"},{"$f":"lcc[[#This Row],[Column1]]","v":45},{"$f":"lcc[[#This Row],[_1]]","v":45},{"$f":"lcc[[#This Row],[_2]]","v":45}]
["constant","IL",{"$f":"lcc[[#This Row],[doe]]","v":"0-50"},{"$f":"lcc[[#This Row],[max er]]","v":"0-50"},{"$f":"lcc[[#This Row],[Column1]]","v":"-"},{"$f":"lcc[[#This Row],[_1]]","v":"-"},{"$f":"lcc[[#This Row],[_2]]","v":"-"}]
["constant","IL",{"$f":"lcc[[#This Row],[doe]]","v":"0-50"},{"$f":"lcc[[#This Row],[max er]]","v":"50-100"},{"$f":"lcc[[#This Row],[Column1]]","v":"-"},{"$f":"lcc[[#This Row],[_1]]","v":"-"},{"$f":"lcc[[#This Row],[_2]]","v":"-"}]
["constant","IL",{"$f":"lcc[[#This Row],[doe]]","v":"0-50"},{"$f":"lcc[[#This Row],[max er]]","v":"100+"},{"$f":"lcc[[#This Row],[Column1]]","v":"-"},{"$f":"lcc[[#This Row],[_1]]","v":"-"},{"$f":"lcc[[#This Row],[_2]]","v":"-"}]
["constant","IL",{"$f":"lcc[[#This Row],[doe]]","v":"50-100"},{"$f":"lcc[[#This Row],[max er]]","v":"0-50"},{"$f":"lcc[[#This Row],[Column1]]","v":"-"},{"$f":"lcc[[#This Row],[_1]]","v":"-"},{"$f":"lcc[[#This Row],[_2]]","v":"-"}]
["constant","IL",{"$f":"lcc[[#This Row],[doe]]","v":"50-100"},{"$f":"lcc[[#This Row],[max er]]","v":"50-100"},{"$f":"lcc[[#This Row],[Column1]]","v":"-"},{"$f":"lcc[[#This Row],[_1]]","v":"-"},{"$f":"lcc[[#This Row],[_2]]","v":"-"}]
["constant","IL",{"$f":"lcc[[#This Row],[doe]]","v":"50-100"},{"$f":"lcc[[#This Row],[max er]]","v":"100+"},{"$f":"lcc[[#This Row],[Column1]]","v":"-"},{"$f":"lcc[[#This Row],[_1]]","v":"-"},{"$f":"lcc[[#This Row],[_2]]","v":"-"}]
["constant","IL",{"$f":"lcc[[#This Row],[doe]]","v":"100-150"},{"$f":"lcc[[#This Row],[max er]]","v":"0-50"},{"$f":"lcc[[#This Row],[Column1]]","v":"-"},{"$f":"lcc[[#This Row],[_1]]","v":"-"},{"$f":"lcc[[#This Row],[_2]]","v":"-"}]
["constant","IL",{"$f":"lcc[[#This Row],[doe]]","v":"100-150"},{"$f":"lcc[[#This Row],[max er]]","v":"50-100"},{"$f":"lcc[[#This Row],[Column1]]","v":"-"},{"$f":"lcc[[#This Row],[_1]]","v":"-"},{"$f":"lcc[[#This Row],[_2]]","v":"-"}]
["constant","IL",{"$f":"lcc[[#This Row],[doe]]","v":"100-150"},{"$f":"lcc[[#This Row],[max er]]","v":"100+"},{"$f":"lcc[[#This Row],[Column1]]","v":"-"},{"$f":"lcc[[#This Row],[_1]]","v":"-"},{"$f":"lcc[[#This Row],[_2]]","v":"-"}]
["constant","IL",{"$f":"lcc[[#This Row],[doe]]","v":"150-200"},{"$f":"lcc[[#This Row],[max er]]","v":"0-50"},{"$f":"lcc[[#This Row],[Column1]]","v":"-"},{"$f":"lcc[[#This Row],[_1]]","v":"-"},{"$f":"lcc[[#This Row],[_2]]","v":"-"}]
["constant","IL",{"$f":"lcc[[#This Row],[doe]]","v":"150-200"},{"$f":"lcc[[#This Row],[max er]]","v":"50-100"},{"$f":"lcc[[#This Row],[Column1]]","v":"-"},{"$f":"lcc[[#This Row],[_1]]","v":"-"},{"$f":"lcc[[#This Row],[_2]]","v":"-"}]
["constant","IL",{"$f":"lcc[[#This Row],[doe]]","v":"150-200"},{"$f":"lcc[[#This Row],[max er]]","v":"100+"},{"$f":"lcc[[#This Row],[Column1]]","v":"-"},{"$f":"lcc[[#This Row],[_1]]","v":"-"},{"$f":"lcc[[#This Row],[_2]]","v":"-"}]
["constant","IL",{"$f":"lcc[[#This Row],[doe]]","v":"200-300"},{"$f":"lcc[[#This Row],[max er]]","v":"0-50"},{"$f":"lcc[[#This Row],[Column1]]","v":"-"},{"$f":"lcc[[#This Row],[_1]]","v":"-"},{"$f":"lcc[[#This Row],[_2]]","v":"-"}]
["constant","IL",{"$f":"lcc[[#This Row],[doe]]","v":"200-300"},{"$f":"lcc[[#This Row],[max er]]","v":"50-100"},{"$f":"lcc[[#This Row],[Column1]]","v":"-"},{"$f":"lcc[[#This Row],[_1]]","v":"-"},{"$f":"lcc[[#This Row],[_2]]","v":"-"}]
["constant","IL",{"$f":"lcc[[#This Row],[doe]]","v":"200-300"},{"$f":"lcc[[#This Row],[max er]]","v":"100+"},{"$f":"lcc[[#This Row],[Column1]]","v":"-"},{"$f":"lcc[[#This Row],[_1]]","v":"-"},{"$f":"lcc[[#This Row],[_2]]","v":"-"}]
["constant","IL",{"$f":"lcc[[#This Row],[doe]]","v":"300-800"},{"$f":"lcc[[#This Row],[max er]]","v":"0-50"},{"$f":"lcc[[#This Row],[Column1]]","v":"-"},{"$f":"lcc[[#This Row],[_1]]","v":"-"},{"$f":"lcc[[#This Row],[_2]]","v":"-"}]
["constant","IL",{"$f":"lcc[[#This Row],[doe]]","v":"300-800"},{"$f":"lcc[[#This Row],[max er]]","v":"50-100"},{"$f":"lcc[[#This Row],[Column1]]","v":"-"},{"$f":"lcc[[#This Row],[_1]]","v":"-"},{"$f":"lcc[[#This Row],[_2]]","v":"-"}]
["constant","IL",{"$f":"lcc[[#This Row],[doe]]","v":"300-800"},{"$f":"lcc[[#This Row],[max er]]","v":"100+"},{"$f":"lcc[[#This Row],[Column1]]","v":"-"},{"$f":"lcc[[#This Row],[_1]]","v":"-"},{"$f":"lcc[[#This Row],[_2]]","v":"-"}]
["constant","IL",{"$f":"lcc[[#This Row],[doe]]","v":"800+"},{"$f":"lcc[[#This Row],[max er]]","v":"0-50"},{"$f":"lcc[[#This Row],[Column1]]","v":"-"},{"$f":"lcc[[#This Row],[_1]]","v":"-"},{"$f":"lcc[[#This Row],[_2]]","v":"-"}]
["constant","IL",{"$f":"lcc[[#This Row],[doe]]","v":"800+"},{"$f":"lcc[[#This Row],[max er]]","v":"50-100"},{"$f":"lcc[[#This Row],[Column1]]","v":"-"},{"$f":"lcc[[#This Row],[_1]]","v":"-"},{"$f":"lcc[[#This Row],[_2]]","v":"-"}]
["constant","IL",{"$f":"lcc[[#This Row],[doe]]","v":"800+"},{"$f":"lcc[[#This Row],[max er]]","v":"100+"},{"$f":"lcc[[#This Row],[Column1]]","v":"-"},{"$f":"lcc[[#This Row],[_1]]","v":"-"},{"$f":"lcc[[#This Row],[_2]]","v":"-"}]
["constant","RSV",{"$f":"lcc[[#This Row],[doe]]","v":"0-50"},{"$f":"lcc[[#This Row],[max er]]","v":"0-50"},{"$f":"lcc[[#This Row],[Column1]]","v":"-"},{"$f":"lcc[[#This Row],[_1]]","v":"-"},{"$f":"lcc[[#This Row],[_2]]","v":"-"}]
["constant","RSV",{"$f":"lcc[[#This Row],[doe]]","v":"0-50"},{"$f":"lcc[[#This Row],[max er]]","v":"50-100"},{"$f":"lcc[[#This Row],[Column1]]","v":"-"},{"$f":"lcc[[#This Row],[_1]]","v":"-"},{"$f":"lcc[[#This Row],[_2]]","v":"-"}]
["constant","RSV",{"$f":"lcc[[#This Row],[doe]]","v":"0-50"},{"$f":"lcc[[#This Row],[max er]]","v":"100+"},{"$f":"lcc[[#This Row],[Column1]]","v":"-"},{"$f":"lcc[[#This Row],[_1]]","v":"-"},{"$f":"lcc[[#This Row],[_2]]","v":"-"}]
["constant","RSV",{"$f":"lcc[[#This Row],[doe]]","v":"50-100"},{"$f":"lcc[[#This Row],[max er]]","v":"0-50"},{"$f":"lcc[[#This Row],[Column1]]","v":"-"},{"$f":"lcc[[#This Row],[_1]]","v":"-"},{"$f":"lcc[[#This Row],[_2]]","v":"-"}]
["constant","RSV",{"$f":"lcc[[#This Row],[doe]]","v":"50-100"},{"$f":"lcc[[#This Row],[max er]]","v":"50-100"},{"$f":"lcc[[#This Row],[Column1]]","v":"-"},{"$f":"lcc[[#This Row],[_1]]","v":"-"},{"$f":"lcc[[#This Row],[_2]]","v":"-"}]
["constant","RSV",{"$f":"lcc[[#This Row],[doe]]","v":"50-100"},{"$f":"lcc[[#This Row],[max er]]","v":"100+"},{"$f":"lcc[[#This Row],[Column1]]","v":"-"},{"$f":"lcc[[#This Row],[_1]]","v":"-"},{"$f":"lcc[[#This Row],[_2]]","v":"-"}]
["constant","RSV",{"$f":"lcc[[#This Row],[doe]]","v":"100-150"},{"$f":"lcc[[#This Row],[max er]]","v":"0-50"},{"$f":"lcc[[#This Row],[Column1]]","v":"-"},{"$f":"lcc[[#This Row],[_1]]","v":"-"},{"$f":"lcc[[#This Row],[_2]]","v":"-"}]
["constant","RSV",{"$f":"lcc[[#This Row],[doe]]","v":"100-150"},{"$f":"lcc[[#This Row],[max er]]","v":"50-100"},{"$f":"lcc[[#This Row],[Column1]]","v":"-"},{"$f":"lcc[[#This Row],[_1]]","v":"-"},{"$f":"lcc[[#This Row],[_2]]","v":"-"}]
["constant","RSV",{"$f":"lcc[[#This Row],[doe]]","v":"100-150"},{"$f":"lcc[[#This Row],[max er]]","v":"100+"},{"$f":"lcc[[#This Row],[Column1]]","v":"-"},{"$f":"lcc[[#This Row],[_1]]","v":"-"},{"$f":"lcc[[#This Row],[_2]]","v":"-"}]
["constant","RSV",{"$f":"lcc[[#This Row],[doe]]","v":"150-200"},{"$f":"lcc[[#This Row],[max er]]","v":"0-50"},{"$f":"lcc[[#This Row],[Column1]]","v":"-"},{"$f":"lcc[[#This Row],[_1]]","v":"-"},{"$f":"lcc[[#This Row],[_2]]","v":"-"}]
["constant","RSV",{"$f":"lcc[[#This Row],[doe]]","v":"150-200"},{"$f":"lcc[[#This Row],[max er]]","v":"50-100"},{"$f":"lcc[[#This Row],[Column1]]","v":"-"},{"$f":"lcc[[#This Row],[_1]]","v":"-"},{"$f":"lcc[[#This Row],[_2]]","v":"-"}]
["constant","RSV",{"$f":"lcc[[#This Row],[doe]]","v":"150-200"},{"$f":"lcc[[#This Row],[max er]]","v":"100+"},{"$f":"lcc[[#This Row],[Column1]]","v":"-"},{"$f":"lcc[[#This Row],[_1]]","v":"-"},{"$f":"lcc[[#This Row],[_2]]","v":"-"}]
["constant","RSV",{"$f":"lcc[[#This Row],[doe]]","v":"200-300"},{"$f":"lcc[[#This Row],[max er]]","v":"0-50"},{"$f":"lcc[[#This Row],[Column1]]","v":"-"},{"$f":"lcc[[#This Row],[_1]]","v":"-"},{"$f":"lcc[[#This Row],[_2]]","v":"-"}]
["constant","RSV",{"$f":"lcc[[#This Row],[doe]]","v":"200-300"},{"$f":"lcc[[#This Row],[max er]]","v":"50-100"},{"$f":"lcc[[#This Row],[Column1]]","v":"-"},{"$f":"lcc[[#This Row],[_1]]","v":"-"},{"$f":"lcc[[#This Row],[_2]]","v":"-"}]
["constant","RSV",{"$f":"lcc[[#This Row],[doe]]","v":"200-300"},{"$f":"lcc[[#This Row],[max er]]","v":"100+"},{"$f":"lcc[[#This Row],[Column1]]","v":"-"},{"$f":"lcc[[#This Row],[_1]]","v":"-"},{"$f":"lcc[[#This Row],[_2]]","v":"-"}]
["constant","RSV",{"$f":"lcc[[#This Row],[doe]]","v":"300-800"},{"$f":"lcc[[#This Row],[max er]]","v":"0-50"},{"$f":"lcc[[#This Row],[Column1]]","v":"-"},{"$f":"lcc[[#This Row],[_1]]","v":"-"},{"$f":"lcc[[#This Row],[_2]]","v":"-"}]
["constant","RSV",{"$f":"lcc[[#This Row],[doe]]","v":"300-800"},{"$f":"lcc[[#This Row],[max er]]","v":"50-100"},{"$f":"lcc[[#This Row],[Column1]]","v":"-"},{"$f":"lcc[[#This Row],[_1]]","v":"-"},{"$f":"lcc[[#This Row],[_2]]","v":"-"}]
["constant","RSV",{"$f":"lcc[[#This Row],[doe]]","v":"300-800"},{"$f":"lcc[[#This Row],[max er]]","v":"100+"},{"$f":"lcc[[#This Row],[Column1]]","v":"-"},{"$f":"lcc[[#This Row],[_1]]","v":"-"},{"$f":"lcc[[#This Row],[_2]]","v":"-"}]
["constant","RSV",{"$f":"lcc[[#This Row],[doe]]","v":"800+"},{"$f":"lcc[[#This Row],[max er]]","v":"0-50"},{"$f":"lcc[[#This Row],[Column1]]","v":"-"},{"$f":"lcc[[#This Row],[_1]]","v":"-"},{"$f":"lcc[[#This Row],[_2]]","v":"-"}]
["constant","RSV",{"$f":"lcc[[#This Row],[doe]]","v":"800+"},{"$f":"lcc[[#This Row],[max er]]","v":"50-100"},{"$f":"lcc[[#This Row],[Column1]]","v":"-"},{"$f":"lcc[[#This Row],[_1]]","v":"-"},{"$f":"lcc[[#This Row],[_2]]","v":"-"}]
["constant","RSV",{"$f":"lcc[[#This Row],[doe]]","v":"800+"},{"$f":"lcc[[#This Row],[max er]]","v":"100+"},{"$f":"lcc[[#This Row],[Column1]]","v":"-"},{"$f":"lcc[[#This Row],[_1]]","v":"-"},{"$f":"lcc[[#This Row],[_2]]","v":"-"}]
["constant","ST",{"$f":"lcc[[#This Row],[doe]]","v":"0-50"},{"$f":"lcc[[#This Row],[max er]]","v":"0-50"},{"$f":"lcc[[#This Row],[Column1]]","v":"-"},{"$f":"lcc[[#This Row],[_1]]","v":"-"},{"$f":"lcc[[#This Row],[_2]]","v":"-"}]
["constant","ST",{"$f":"lcc[[#This Row],[doe]]","v":"0-50"},{"$f":"lcc[[#This Row],[max er]]","v":"50-100"},{"$f":"lcc[[#This Row],[Column1]]","v":"-"},{"$f":"lcc[[#This Row],[_1]]","v":"-"},{"$f":"lcc[[#This Row],[_2]]","v":"-"}]
["constant","ST",{"$f":"lcc[[#This Row],[doe]]","v":"0-50"},{"$f":"lcc[[#This Row],[max er]]","v":"100+"},{"$f":"lcc[[#This Row],[Column1]]","v":"-"},{"$f":"lcc[[#This Row],[_1]]","v":"-"},{"$f":"lcc[[#This Row],[_2]]","v":"-"}]
["constant","ST",{"$f":"lcc[[#This Row],[doe]]","v":"50-100"},{"$f":"lcc[[#This Row],[max er]]","v":"0-50"},{"$f":"lcc[[#This Row],[Column1]]","v":"-"},{"$f":"lcc[[#This Row],[_1]]","v":"-"},{"$f":"lcc[[#This Row],[_2]]","v":"-"}]
["constant","ST",{"$f":"lcc[[#This Row],[doe]]","v":"50-100"},{"$f":"lcc[[#This Row],[max er]]","v":"50-100"},{"$f":"lcc[[#This Row],[Column1]]","v":"-"},{"$f":"lcc[[#This Row],[_1]]","v":"-"},{"$f":"lcc[[#This Row],[_2]]","v":"-"}]
["constant","ST",{"$f":"lcc[[#This Row],[doe]]","v":"50-100"},{"$f":"lcc[[#This Row],[max er]]","v":"100+"},{"$f":"lcc[[#This Row],[Column1]]","v":"-"},{"$f":"lcc[[#This Row],[_1]]","v":"-"},{"$f":"lcc[[#This Row],[_2]]","v":"-"}]
["constant","ST",{"$f":"lcc[[#This Row],[doe]]","v":"100-150"},{"$f":"lcc[[#This Row],[max er]]","v":"0-50"},{"$f":"lcc[[#This Row],[Column1]]","v":"-"},{"$f":"lcc[[#This Row],[_1]]","v":"-"},{"$f":"lcc[[#This Row],[_2]]","v":"-"}]
["constant","ST",{"$f":"lcc[[#This Row],[doe]]","v":"100-150"},{"$f":"lcc[[#This Row],[max er]]","v":"50-100"},{"$f":"lcc[[#This Row],[Column1]]","v":"-"},{"$f":"lcc[[#This Row],[_1]]","v":"-"},{"$f":"lcc[[#This Row],[_2]]","v":"-"}]
["constant","ST",{"$f":"lcc[[#This Row],[doe]]","v":"100-150"},{"$f":"lcc[[#This Row],[max er]]","v":"100+"},{"$f":"lcc[[#This Row],[Column1]]","v":"-"},{"$f":"lcc[[#This Row],[_1]]","v":"-"},{"$f":"lcc[[#This Row],[_2]]","v":"-"}]
["constant","ST",{"$f":"lcc[[#This Row],[doe]]","v":"150-200"},{"$f":"lcc[[#This Row],[max er]]","v":"0-50"},{"$f":"lcc[[#This Row],[Column1]]","v":"-"},{"$f":"lcc[[#This Row],[_1]]","v":"-"},{"$f":"lcc[[#This Row],[_2]]","v":"-"}]
["constant","ST",{"$f":"lcc[[#This Row],[doe]]","v":"150-200"},{"$f":"lcc[[#This Row],[max er]]","v":"50-100"},{"$f":"lcc[[#This Row],[Column1]]","v":"-"},{"$f":"lcc[[#This Row],[_1]]","v":"-"},{"$f":"lcc[[#This Row],[_2]]","v":"-"}]
["constant","ST",{"$f":"lcc[[#This Row],[doe]]","v":"150-200"},{"$f":"lcc[[#This Row],[max er]]","v":"100+"},{"$f":"lcc[[#This Row],[Column1]]","v":"-"},{"$f":"lcc[[#This Row],[_1]]","v":"-"},{"$f":"lcc[[#This Row],[_2]]","v":"-"}]
["constant","ST",{"$f":"lcc[[#This Row],[doe]]","v":"200-300"},{"$f":"lcc[[#This Row],[max er]]","v":"0-50"},{"$f":"lcc[[#This Row],[Column1]]","v":"-"},{"$f":"lcc[[#This Row],[_1]]","v":"-"},{"$f":"lcc[[#This Row],[_2]]","v":"-"}]
["constant","ST",{"$f":"lcc[[#This Row],[doe]]","v":"200-300"},{"$f":"lcc[[#This Row],[max er]]","v":"50-100"},{"$f":"lcc[[#This Row],[Column1]]","v":"-"},{"$f":"lcc[[#This Row],[_1]]","v":"-"},{"$f":"lcc[[#This Row],[_2]]","v":"-"}]
["constant","ST",{"$f":"lcc[[#This Row],[doe]]","v":"200-300"},{"$f":"lcc[[#This Row],[max er]]","v":"100+"},{"$f":"lcc[[#This Row],[Column1]]","v":"-"},{"$f":"lcc[[#This Row],[_1]]","v":"-"},{"$f":"lcc[[#This Row],[_2]]","v":"-"}]
["constant","ST",{"$f":"lcc[[#This Row],[doe]]","v":"300-800"},{"$f":"lcc[[#This Row],[max er]]","v":"0-50"},{"$f":"lcc[[#This Row],[Column1]]","v":"-"},{"$f":"lcc[[#This Row],[_1]]","v":"-"},{"$f":"lcc[[#This Row],[_2]]","v":"-"}]
["constant","ST",{"$f":"lcc[[#This Row],[doe]]","v":"300-800"},{"$f":"lcc[[#This Row],[max er]]","v":"50-100"},{"$f":"lcc[[#This Row],[Column1]]","v":"-"},{"$f":"lcc[[#This Row],[_1]]","v":"-"},{"$f":"lcc[[#This Row],[_2]]","v":"-"}]
["constant","ST",{"$f":"lcc[[#This Row],[doe]]","v":"300-800"},{"$f":"lcc[[#This Row],[max er]]","v":"100+"},{"$f":"lcc[[#This Row],[Column1]]","v":"-"},{"$f":"lcc[[#This Row],[_1]]","v":"-"},{"$f":"lcc[[#This Row],[_2]]","v":"-"}]
["constant","ST",{"$f":"lcc[[#This Row],[doe]]","v":"800+"},{"$f":"lcc[[#This Row],[max er]]","v":"0-50"},{"$f":"lcc[[#This Row],[Column1]]","v":"-"},{"$f":"lcc[[#This Row],[_1]]","v":"-"},{"$f":"lcc[[#This Row],[_2]]","v":"-"}]
["constant","ST",{"$f":"lcc[[#This Row],[doe]]","v":"800+"},{"$f":"lcc[[#This Row],[max er]]","v":"50-100"},{"$f":"lcc[[#This Row],[Column1]]","v":"-"},{"$f":"lcc[[#This Row],[_1]]","v":"-"},{"$f":"lcc[[#This Row],[_2]]","v":"-"}]
["constant","ST",{"$f":"lcc[[#This Row],[doe]]","v":"800+"},{"$f":"lcc[[#This Row],[max er]]","v":"100+"},{"$f":"lcc[[#This Row],[Column1]]","v":"-"},{"$f":"lcc[[#This Row],[_1]]","v":"-"},{"$f":"lcc[[#This Row],[_2]]","v":"-"}]

{"sheet":"Cost of Electricity","index":12,"n_rows":62,"n_cols":2,"rows_kept":62,"cut":false,"hidden":true,"merged":[]}
["Cost of Electricity"]
[]
["This tab holds the average cost of electricity for each state in the USA, as well as the District of Columbia."]
["If the state the pump is located in is unavailable a national average is used."]
[]
[]
["State","Cost of electricity"]
[null,0.10529999999999999]
["Unknown",0.10529999999999999]
["Alabama",9.6300000000000011E-2]
["Alaska",0.19359999999999999]
["Arizona",0.1085]
["Arkansas",7.7800000000000008E-2]
["California",0.16579999999999998]
["Colorado",0.1002]
["Connecticut",0.18410000000000001]
["District of Columbia",0.12029999999999999]
["Delaware",0.10550000000000001]
["Florida",0.1032]
["Georgia",9.6199999999999994E-2]
["Hawaii",0.2918]
["Idaho",8.1699999999999995E-2]
["Illinois",9.6000000000000002E-2]
["Indiana",9.7500000000000003E-2]
["Iowa",8.9200000000000002E-2]
["Kansas",0.1072]
["Kentucky",8.5199999999999998E-2]
["Louisiana",7.7100000000000002E-2]
["Maine",0.13439999999999999]
["Maryland",0.1157]
["Massachusetts",0.185]
["Michigan",0.114]
["Minnesota",0.10369999999999999]
["Mississippi",9.2399999999999996E-2]
["Missouri",9.9299999999999999E-2]
["Montana",8.8399999999999992E-2]
["Nebraska",9.0200000000000002E-2]
["Nevada",8.6699999999999999E-2]
["New Hampshire",0.17010000000000003]
["New Jersey",0.1323]
["New Mexico",9.35E-2]
["New York",0.14829999999999999]
["North Carolina",9.2499999999999999E-2]
["North Dakota",8.9099999999999999E-2]
["Ohio",9.9399999999999988E-2]
["Oklahoma",8.09E-2]
["Oregon",8.8499999999999995E-2]
["Pennsylvania",0.10099999999999999]
["Rhode Island",0.18100000000000002]
["South Carolina",9.6699999999999994E-2]
["South Dakota",9.9700000000000011E-2]
["Tennessee",9.5799999999999996E-2]
["Texas",8.48E-2]
["Utah",8.2100000000000006E-2]
["Vermont",0.15130000000000002]
["Virginia",9.4800000000000009E-2]
["Washington",0.08]
["West Virginia",8.72E-2]
["Wisconsin",0.10580000000000001]
["Wyoming",8.09E-2]
["Source: https://www.eia.gov/electricity/state/"]
["State electricity profiles, Data for 2018, released December 31, 2019"]