{"text_format":"1","workbook":"xlsx","n_sheets":13,"sheets":["Life-Cycle Cost Analysis","LinkedData","Site Specific Savings","General Savings","AdditionalInformation","Site_based calculation","General_savings Calculations","MeasureTable","Lifetime","Lists","Site-specific Lists","sample-llc","Cost of Electricity"],"not_rendered":{"charts":1,"images":3,"macros":1,"external_links":0,"defined_names":17,"comments":2,"pivot_tables":0},"unopened":[],"bounds":{"document_bytes":16777216,"sheet_cells":100000,"rows_first":2000,"rows_last":500,"rows_between":2000,"halvings":0,"cell_chars":16384,"cell_head_chars":4096},"cells_cut":0,"cells_raw":0,"read":"whole","date_system":"1900"}

{"sheet":"Life-Cycle Cost Analysis","index":0,"n_rows":69,"n_cols":27,"rows_kept":69,"cut":false,"hidden":false,"merged":[[68,26,70,28],[68,18,70,25],[6,1,8,16],[67,18,67,19],[3,1,4,13],[3,14,4,16],[63,26,64,28],[65,26,66,28],[62,18,62,19],[66,18,66,19],[65,18,65,19],[64,18,64,19],[63,18,63,19],[63,20,64,25],[62,20,62,25],[66,20,67,25],[65,20,65,25],[62,26,62,28],[67,26,67,28]]}
[null,null,null,null,null,"ER Life Cycle Cost Calculator, Efficient Pumping Systems"]
[]
[]
[null,"This workbook calculates the difference in Life Cycle Costs associated with purchasing and installing efficient pumping systems, when compared to an installation with a lower Energy Rating (ER).",null,null,null,null,null,null,null,null,null,null,null,null,"Version 1.0.0"]
[]
[]
[null,"Traditionally, LCC Analysis looks at the total cost and total benefit of different scenarios which serve the needed purpose. This workbook presents the incremental difference in cost and benefit between different efficient pumping scenarios compared to an average pump."]
[]
[]
[null,null,null,null,null,null,null,null,null,null,null,null,null,null,null,null,null,null,"How to use the calculator tabs:"]
{"$rows_left_out":60}
{"sheet":"LinkedData","index":1,"n_rows":622,"n_cols":7,"rows_kept":622,"cut":false,"hidden":true,"merged":[]}
["speed","rated motor power","doe","max er","Column1","_1","_2"]
["constant",1,"ESCC",17,"","",""]
["constant",1,"ESFM",3,"","",""]
["constant",1,"IL",15,"","",""]
["constant",1,"RSV",17,"","",""]
["constant",1,"ST","-","","",""]
["constant",1.5,"ESCC",28,"","",""]
["constant",1.5,"ESFM",30,"","",""]
["constant",1.5,"IL",20,"","",""]
["constant",1.5,"RSV",12,"","",""]
{"$rows_left_out":613}
{"sheet":"Site Specific Savings","index":2,"n_rows":33,"n_cols":16,"rows_kept":33,"cut":false,"hidden":false,"merged":[[7,15,8,17],[9,15,9,17],[7,11,8,13],[9,11,9,13],[20,11,20,13],[18,11,19,13],[16,11,16,13],[15,11,15,13],[11,11,12,13],[11,15,12,17],[32,13,32,15],[30,13,31,15],[28,13,28,15],[26,13,27,15],[24,11,24,13],[22,11,23,13],[3,11,3,17],[12,6,12,8],[24,15,24,17],[22,15,23,17],[13,1,13,8],[15,2,15,6],[20,2,20,6],[21,2,21,6],[22,2,22,6],[13,15,13,17],[13,11,13,13],[20,15,20,17],[18,15,19,17],[16,15,16,17],[15,15,15,17],[3,6,3,9],[25,2,25,6],[30,2,30,6],[19,2,19,6],[18,2,18,6],[17,2,17,6],[29,2,29,6],[26,2,26,6],[27,2,27,6],[28,2,28,6],[16,2,16,8],[23,2,23,8],[24,2,24,6]]}
[null,"Site-Based Energy Savings Calculations"]
[]
[]
[null,null,null,null,null,null,"System Information",null,null,null,null,"Total Change in Life Cycle Costs ($)"]
[]
[null,null,null,null,null,null,null,"State"]
[null,null,null,null,null,null,null,"Pumping Application"]
[null,null,null,null,null,null,null,"Cost of Electricity, $/kWh (if Unknown, Leave Blank)",null,null,null,"Lifetime Energy \nSavings (kWh)",null,null,null,"Lifetime Energy \nSavings ($)"]
[null,null,null,null,null,null,null,"Pump Lifetime used in calculation",{"$f":"ROUND('Site_based calculation'!B5,0)&\" years\"","v":"14 years"}]
[null,null,null,null,null,null,null,"Cost of electricity used in calculation, $/kWh",{"$f":"'Site_based calculation'!B3","v":0.10529999999999999},null,null,{"$f":"IF('Site_based calculation'!B4=\"No\",\"\",'Site_based calculation'!B23)","v":""},null,null,null,{"$f":"IF('Site_based calculation'!B4=\"No\",\"\",'Site_based calculation'!B25)","v":""}]
{"$rows_left_out":24}
{"sheet":"General Savings","index":3,"n_rows":51,"n_cols":16,"rows_kept":51,"cut":false,"hidden":false,"merged":[[4,13,6,13],[20,2,20,5],[26,2,27,5],[24,4,24,5],[23,4,23,5],[22,4,22,5],[21,4,21,5],[20,13,20,15],[26,13,27,15],[20,8,20,10],[21,8,21,9],[26,8,27,10],[31,4,31,5],[30,4,30,5],[29,4,29,5],[28,4,28,5],[25,4,25,5],[40,8,40,9],[39,8,39,10],[45,8,46,10],[39,13,39,15],[45,13,46,15]]}
["General Energy Savings Calculations"]
[]
[]
[]
[null,null,"General System information","Enter Information Here",null,null,null,null,null,null,null,null,null,"Number of Pumps in the ER \ndatabase that meet your \nspecified design point: "]
[null,null,"State"]
[null,null,"Application"]
[null,null,"Price of Electricity ($/kW)",{"$f":"IF(D6=\"\",'Cost of Electricity'!B8,VLOOKUP(D6,'Cost of Electricity'!$A$9:$B$60,2,FALSE))","v":0.10529999999999999}]
[null,null,"Pump Type"]
[null,null,"Does Existing Pump Have a Variable Speed Drive?"]
{"$rows_left_out":42}
{"sheet":"AdditionalInformation","index":4,"n_rows":7,"n_cols":6,"rows_kept":7,"cut":false,"hidden":false,"merged":[[3,1,4,16],[6,1,8,16]]}
[null,null,null,null,null,"Energy Savings Calculations, Additional Information"]
[]
[]
[null,"To calculate energy savings this workbook makes certain assumptions. These assumptions are based on operational information collected on commercial and industrial clean water pumps. This tab discusses three aspects of the energy analysis: \nVariable Speed Pump Operation\nOperating Hours\nLoad Profile\n"]
[]
[]
[null,"For more detailed information on the energy savings equation and the information used in for this calculator, see the Deemed Measure List and Technical Resources Manual (TRM)\nat http://www.pumps.org/Utility_Resources.aspx "]

{"sheet":"Site_based calculation","index":5,"n_rows":57,"n_cols":3,"rows_kept":57,"cut":false,"hidden":true,"merged":[]}
["Energy"]
["Application",{"$f":"'Site Specific Savings'!I7","v":0}]
["Cost of Electricity",{"$f":"IF('Site Specific Savings'!I8=\"\",IF('Site Specific Savings'!I6=\"\",'Cost of Electricity'!B8,VLOOKUP('Site Specific Savings'!I6,'Cost of Electricity'!A8:B60,2,FALSE)),'Site Specific Savings'!I8)","v":0.10529999999999999}]
["Enough information for calculation",{"$f":"IF(OR('Site Specific Savings'!I6=\"\",'Site Specific Savings'!I7=\"\",'Site Specific Savings'!H19=\"\",'Site Specific Savings'!H23=\"\",'Site Specific Savings'!H22=\"\",'Site Specific Savings'!I23=\"\",'Site Specific Savings'!I22=\"\",'Site Specific Savings'!I19=\"\",'Site Specific Savings'!I23=\"\",'Site Specific Savings'!I22=\"\"),\"No\",\"Yes\")","v":"No"}]
["Base Case Lifetime",{"$f":"IF(AND('Site Specific Savings'!H18=\"\",'Site Specific Savings'!H21=\"\"),AVERAGE('Site-specific Lists'!$AO$3:$AO$7),\nIF('Site Specific Savings'!H21=\"\",VLOOKUP('Site Specific Savings'!H18,'Site-specific Lists'!$AN$3:$AO$7,2,FALSE),'Site Specific Savings'!H21))","v":14.100800000000001}]
["Base Case Operating Hours",{"$f":"IF('Site Specific Savings'!H20=\"\",VLOOKUP('Site Specific Savings'!I7,'Site-specific Lists'!$A$3:$B$9,2,FALSE),'Site Specific Savings'!H20)","v":{"$error":"#N/A"}}]
["Base Case Motor Horsepower",{"$f":"'Site Specific Savings'!H19","v":0}]
["Base Case Motor Horsepower Bin",{"$f":"IF(B13=\"VS->VS\",INDEX('Site-specific Lists'!AA3:AA7,MATCH('Site_based calculation'!B7,'Site-specific Lists'!Z3:Z7,-1)),\nIF(B13=\"CS->CS\",INDEX('Site-specific Lists'!$AD$3:$AD$6,MATCH('Site_based calculation'!B7,'Site-specific Lists'!AC3:AC6,-1)),\nIF(B13=\"CS->VS\",INDEX('Site-specific Lists'!$AG$3:$AG$7,MATCH('Site_based calculation'!B7,'Site-specific Lists'!AF3:AF7,-1)),FALSE())))","v":false}]
["Base Case Energy Rating",{"$f":"'Site Specific Savings'!H23","v":0}]
["Base Case Motor Oversizing",{"$f":"INDEX('Site-specific Lists'!O4:O13,MATCH('Site_based calculation'!B8,'Site-specific Lists'!$N$4:$N$13,0))","v":{"$error":"#N/A"}}]
{"$rows_left_out":48}
{"sheet":"General_savings Calculations","index":6,"n_rows":40,"n_cols":9,"rows_kept":40,"cut":false,"hidden":true,"merged":[[1,0,1,1],[25,7,25,8],[11,0,11,1],[3,4,3,5],[25,0,25,1]]}
[]
["Pump information"]
["Speed Control",{"$f":"VLOOKUP('General Savings'!D10,Lists!K3:N4,3,FALSE)","v":{"$error":"#N/A"}}]
["ER_Database Speed Control Code",{"$f":"IF(B3=\"Variable Speed\",\"variable\",\"constant\")","v":{"$error":"#N/A"}},null,null,"If design point is provided",null,"BEP Bins",{"$f":"AVERAGE(IF(((MeasureTable!B9:B536=B5)*(MeasureTable!C9:C536=B9)*(MeasureTable!D9:D536=F14)*(MeasureTable!E9:E536='General Savings'!K22))>0,MeasureTable!R9:R536))","v":{"$error":"#N/A"}}]
["Measure Speed Control Code",{"$f":"VLOOKUP('General Savings'!D10,Lists!K3:N4,4,FALSE)","v":{"$error":"#N/A"}},null,null,"Design Flow",{"$f":"'General Savings'!D15","v":0},{"$f":"INDEX(Lists!$AE$2:$AE$8,MATCH(F5,Lists!$AF$2:$AF$8,1))","v":{"$error":"#N/A"}}]
["Pump Type",{"$f":"VLOOKUP('General Savings'!D9,Lists!$E$3:$F$7,2,FALSE)","v":{"$error":"#N/A"}},null,null,"Design Head",{"$f":"'General Savings'!D14","v":0},{"$f":"INDEX(Lists!$AI$2:$AI$4,MATCH(F6,Lists!$AJ$2:$AJ$4,1))","v":{"$error":"#N/A"}}]
["Motor HP",{"$f":"'General Savings'!D11","v":0}]
["Nominal Speed",null,null,null,"Number of pumps that meet the design requirements",{"$f":"_xlfn.IFNA(SUMPRODUCT(('sample-llc'!$B$203:$B$622=B6)*('sample-llc'!$A$203:$A$622=B4)*('sample-llc'!$C$203:$C$622=$G$5)*('sample-llc'!$D$203:$D$622=G6)*('sample-llc'!$F$203:$F$622<>\"-\")),0)","v":0}]
["Application",{"$f":"'General Savings'!D7","v":0},null,null,"Does ER Database list a pump with the specific head and flow requirements provided?",{"$f":"IF(F8=0,\"No\",\"Yes\")","v":"No"}]
["Is there enough info provided",{"$f":"IF(OR('General Savings'!D7=\"\",'General Savings'!D9=\"\",'General Savings'!D10=\"\",'General Savings'!D13=\"\",B7=0),\"No\",\"Yes\")","v":"No"}]
{"$rows_left_out":31}
{"sheet":"MeasureTable","index":7,"n_rows":536,"n_cols":19,"rows_kept":536,"cut":false,"hidden":true,"merged":[]}
["Measure Table"]
[]
["Each measure below represents a unique combination of measure identifiers and the associated energy savings and increase in cost. "]
[]
[]
[]
[]
["Number","Speed Control","Application","HP Bin","ER","ER index","Sector","Ophrs ","MO_Factor","Base_AdjFactor1","Base_Adjfactor2","Efficient Adjustment Factor","Baseline_PEI_1","Baseline_PEI_2","DeltaER","Baseline Energy Consumption (kWh/HP)","Efficient Energy Consumption (kWh/HP)","Energy Savings (kWh/HP/year)","Cost ($/HP)"]
[1,"CS","Commercial HVAC","1 - 2.9 HP",6,1,"Commercial",4000,0.37605304702478665,1.25,1.25,1.25,0.96,0.96,2,2234.2292492136439,2187.6828065216928,46.546442691951142,43.398688628708911]
[2,"CS","Commercial HVAC","1 - 2.9 HP",7,2,"Commercial",4000,0.37605304702478665,1.25,1.25,1.25,0.96,0.96,3,2234.2292492136439,2164.4095851757174,69.819664037926486,65.098032943063373]
{"$rows_left_out":527}
{"sheet":"Lifetime","index":8,"n_rows":7,"n_cols":3,"rows_kept":7,"cut":false,"hidden":true,"merged":[]}
[]
[null,"Pump Code","Lifetime"]
[null,"ESCC",11.221]
[null,"ESFM",22.992999999999995]
[null,"IL",15.290000000000003]
[null,"RSV",10.5]
[null,"ST",10.500000000000002]

{"sheet":"Lists","index":9,"n_rows":54,"n_cols":37,"rows_kept":54,"cut":false,"hidden":true,"merged":[]}
["State",null,"Sector",null,"Pump Type","Pump Code",null,"Nominal Speed","Nominal Speed_For measures",null,"Equipped with VSD","Speed Control_hpBins","Speed Control_measures",null,null,null,"VS Horsepower","Variable Speed",null,"CS Horsepower","Constant Speed",null,null,"CS_VS ",null,null,"Motor Horsepower",null,null,null,"flow","=>","<",null,"Head","=>","<"]
[null,null,null,null,null,null,null,"1800 RPM",1800,null,{"$f":"\"\"","v":""},null,null,null,null,null,"User Enterd","MotorHP Range",null,"User Entered","MotorHP Range",null,"User Entered","MotorHP Range",250,null,null,null,null,null,"0-50",1,50,null,"0-50",1,50]
["Unknown",null,"Commercial HVAC",null,"End Suction Close Coupled","ESCC",null,"3600 RPM",3600,null,"No","ConstantSpeed","Constant Speed","CS",null,null,200,"50.1 - 200 HP",null,200,"50.1 - 200 HP",null,200,"20.1 - 200 HP",200,null,1,null,null,null,"50-100",50,100,null,"50-100",50,100]
["Alabama",null,"Commercial DHW",null,"End Suction Frame Mounted","ESFM",null,null,null,null,"Yes","VariableSpeed","Variable Speed","VSCode",null,null,50,"6 - 50 HP",null,50,"20 - 50 HP",null,20,"6 - 20 HP",150,null,1.5,null,null,null,"100-150",100,150,null,"100+",100,10000000000]
["Alaska",null,"Municipal",null,"In Line","IL",null,null,null,null,null,null,null,null,null,null,5.9,"3 - 5.9 HP",null,19.899999999999999,"3 - 19.9 HP",null,5.9,"3 - 5.9 HP",125,null,2,null,null,null,"150-200",150,200]
["Arizona",null,"Industrial BFW",null,"Radial Split Vertical","RSV",null,null,null,null,null,null,null,null,null,null,2.9,"2 - 2.9 HP",null,2.9,"1 - 2.9 HP",null,2.9,"2 - 2.9 HP",100,null,3,null,null,null,"200-300",200,300]
["Arkansas",null,"Industrial General",null,"Submersible Turbine","ST",null,null,null,null,null,null,null,null,null,null,1.9,"1 - 1.9 HP",null,null,null,null,1.9,"1 - 1.9 HP",75,null,5,null,null,null,"300-800",300,800]
["California",null,"Agricultural",null,null,null,null,null,null,null,null,null,null,null,null,null,null,null,null,null,null,null,null,null,60,null,7.5,null,null,null,"800+",800,100000000]
["Colorado",null,null,null,null,null,null,null,null,null,null,null,null,null,null,null,null,null,null,null,null,null,null,null,50,null,10]
["Connecticut",null,null,null,null,null,null,null,null,null,null,null,null,null,null,null,null,null,null,null,null,null,null,null,40,null,15]
{"$rows_left_out":45}
{"sheet":"Site-specific Lists","index":10,"n_rows":54,"n_cols":51,"rows_kept":54,"cut":false,"hidden":true,"merged":[[0,16,0,19]]}
["Pumping Applications","Operating Hours",null,"Motor Horsepower",null,"Pump Speed Control",null,"Pump Type",null,"Nominal Speed",null,"State",null,"Horsepower Bin","Motor Oversizing Factor",null,"Incremental ER Increase Cost",null,null,null,null,null,null,null,null,"VS Horsepower","VS-->VS",null,"CS Horsepower","cs->cs",null,null,"CS_VS ",null,null,"Application","Constant Speed","Variable speed",null,"Pump Code","Lifetime",null,null,"Horsepower bin",null,"$/HP",null,null,null,"Baseline ER List","Efficient Case ER"]
[null,null,null,null,null,null,null,null,null,null,null,null,null,null,null,null,null,null,null,null,null,null,null,null,null,"User Enterd","MotorHP Range",null,"User Entered","MotorHP Range",null,"User Entered","MotorHP Range",null,null,null,null,null,null,null,null,null,null,1,"1 - 1.9 HP",868.29981318176397]
["Commercial HVAC",4000,null,1,null,"Constant Speed Control",null,"End Suction Close Coupled",null,"1800 RPM",null,"Unknown",null,null,null,null,"Speed Control Case","Motor HP Bin","Incremental Cost increase ($2020)","Units",null,null,null,null,null,200,"50.1 - 200 HP",null,200,"50.1 - 200 HP",null,200,"20.1 - 200 HP",null,null,"Agricultural",1.325,1.845,null,"End Suction Close Coupled",11.221,null,null,2,"2 - 2.9 HP",448.63123948199433,null,null,null,{"$f":"IF('Site Specific Savings'!H22=\"Variable Speed Control\",34,0)","v":0},{"$f":"IF('Site Specific Savings'!I22=\"Variable Speed Control\",34,0)","v":0}]
["Commercial DHW",6000,null,1.5,null,"Variable Speed Control",null,"End Suction Frame Mounted",null,"3600 RPM",null,"Alabama",null,"1 - 1.9 HP",0.39003439574594323,null,"CS->CS","1 - 2.9 HP",21.699344314354455,"$/ΔER/HP",null,"Motor HP",null,"2020",null,50,"6 - 50 HP",null,50,"20 - 50 HP",null,20,"6 - 20 HP",null,null,"Commercial HVAC",1.25,1,null,"End Suction Frame Mounted",22.992999999999995,null,null,3,"3 - 5.9 HP",304.87372497270155,null,null,null,{"$f":"AX3+1","v":1},{"$f":"AY3+1","v":1}]
["Municipal",3400,null,2,null,null,null,"In Line",null,null,null,"Alaska",null,"1 - 2.9 HP",0.37605304702478665,null,"CS->CS","3 - 19.9 HP",7.4220867283475824,"$/ΔER/HP",null,"1 - 1.9 HP",979.63620210183069,"$/HP",null,5.9,"3 - 5.9 HP",null,19.899999999999999,"3 - 19.9 HP",null,5.9,"3 - 5.9 HP",null,null,"Commercial DHW",1.25,1,null,"In Line",15.290000000000003,null,null,6,"6 - 20 HP",142.17472167923833,null,null,null,{"$f":"AX4+1","v":2},2]
["Industrial BFW",4000,null,3,null,null,null,"Radial Split Vertical ",null,null,null,"Arizona",null,"2 - 2.9 HP",0.36520827043091608,null,"CS->CS","20 - 50 HP",3.1459643741439685,"$/ΔER/HP",null,"2 - 2.9 HP",506.15628025981948,"$/HP",null,2.9,"2 - 2.9 HP",null,2.9,"1 - 2.9 HP",null,2.9,"2 - 2.9 HP",null,null,"Industrial BFW",1.31,1.214,null,"Radial Split Vertical ",10.5,null,null,20.100000000000001,"20.1 - 200 HP",87.954702114013742,null,null,null,3,3]
["Industrial General",6800,null,5,null,null,null,"Submersible Turbine",null,null,null,"Arkansas",null,"3 - 5.9 HP",0.33664183851667306,null,"CS->CS","50.1 - 200 HP",1.1744718740714775,"$/ΔER/HP",null,"3 - 5.9 HP",343.96568272711909,"$/HP",null,1.9,"1 - 1.9 HP",null,null,null,null,1.9,"1 - 1.9 HP",null,null,"Industrial General",1.31,1.214,null,"Submersible Turbine",10.500000000000002,null,null,null,null,null,null,null,null,4,4]
["Agricultural",2400,null,7.5,null,null,null,null,null,null,null,"California",null,"3 - 19.9 HP",0.29104193408105666,null,"VS->VS","1 - 1.9 HP",33.472566,"$/ΔER/HP",null,"6 - 20 HP",160.4048535613102,"$/HP",null,null,null,null,null,null,null,null,null,null,null,"Municipal",0.84,0.99,null,null,null,null,null,null,null,null,null,null,null,5,5]
["Unknown",{"$f":"AVERAGE(B3:B8)","v":4433.333333333333},null,10,null,null,null,null,null,null,null,"Colorado",null,"6 - 20 HP",0.28489689669884105,null,"VS->VS","2 - 2.9 HP",17.986920000000005,"$/ΔER/HP",null,"20.1 - 200 HP",99.232556575401887,"$/HP",null,null,null,null,null,null,null,null,null,null,null,"Unknown",{"$f":"AVERAGE(AK3:AK8)","v":1.2141666666666666},{"$f":"AVERAGE(AL3:AL8)","v":1.2104999999999999},null,null,null,null,null,null,null,null,null,null,null,6,6]
[null,null,null,15,null,null,null,null,null,null,null,"Connecticut",null,"6 - 50 HP",0.24770815248632091,null,"VS->VS","3 - 5.9 HP",10.044198000000003,"$/ΔER/HP",null,null,null,null,null,null,null,null,null,null,null,null,null,null,null,null,null,null,null,null,null,null,null,null,null,null,null,null,null,7,7]
{"$rows_left_out":45}
{"sheet":"sample-llc","index":11,"n_rows":622,"n_cols":7,"rows_kept":622,"cut":false,"hidden":true,"merged":[]}
["speed","rated motor power","doe","max er"]
[{"$f":"lcc[[#This Row],[speed]]","v":"constant"},{"$f":"lcc[[#This Row],[rated motor power]]","v":1},{"$f":"lcc[[#This Row],[doe]]","v":"ESCC"},{"$f":"lcc[[#This Row],[max er]]","v":17},{"$f":"lcc[[#This Row],[Column1]]","v":""},{"$f":"lcc[[#This Row],[_1]]","v":""},{"$f":"lcc[[#This Row],[_2]]","v":""}]
[{"$f":"lcc[[#This Row],[speed]]","v":"constant"},{"$f":"lcc[[#This Row],[rated motor power]]","v":1},{"$f":"lcc[[#This Row],[doe]]","v":"ESFM"},{"$f":"lcc[[#This Row],[max er]]","v":3},{"$f":"lcc[[#This Row],[Column1]]","v":""},{"$f":"lcc[[#This Row],[_1]]","v":""},{"$f":"lcc[[#This Row],[_2]]","v":""}]
[{"$f":"lcc[[#This Row],[speed]]","v":"constant"},{"$f":"lcc[[#This Row],[rated motor power]]","v":1},{"$f":"lcc[[#This Row],[doe]]","v":"IL"},{"$f":"lcc[[#This Row],[max er]]","v":15},{"$f":"lcc[[#This Row],[Column1]]","v":""},{"$f":"lcc[[#This Row],[_1]]","v":""},{"$f":"lcc[[#This Row],[_2]]","v":""}]
[{"$f":"lcc[[#This Row],[speed]]","v":"constant"},{"$f":"lcc[[#This Row],[rated motor power]]","v":1},{"$f":"lcc[[#This Row],[doe]]","v":"RSV"},{"$f":"lcc[[#This Row],[max er]]","v":17},{"$f":"lcc[[#This Row],[Column1]]","v":""},{"$f":"lcc[[#This Row],[_1]]","v":""},{"$f":"lcc[[#This Row],[_2]]","v":""}]
[{"$f":"lcc[[#This Row],[speed]]","v":"constant"},{"$f":"lcc[[#This Row],[rated motor power]]","v":1},{"$f":"lcc[[#This Row],[doe]]","v":"ST"},{"$f":"lcc[[#This Row],[max er]]","v":"-"},{"$f":"lcc[[#This Row],[Column1]]","v":""},{"$f":"lcc[[#This Row],[_1]]","v":""},{"$f":"lcc[[#This Row],[_2]]","v":""}]
[{"$f":"lcc[[#This Row],[speed]]","v":"constant"},{"$f":"lcc[[#This Row],[rated motor power]]","v":1.5},{"$f":"lcc[[#This Row],[doe]]","v":"ESCC"},{"$f":"lcc[[#This Row],[max er]]","v":28},{"$f":"lcc[[#This Row],[Column1]]","v":""},{"$f":"lcc[[#This Row],[_1]]","v":""},{"$f":"lcc[[#This Row],[_2]]","v":""}]
[{"$f":"lcc[[#This Row],[speed]]","v":"constant"},{"$f":"lcc[[#This Row],[rated motor power]]","v":1.5},{"$f":"lcc[[#This Row],[doe]]","v":"ESFM"},{"$f":"lcc[[#This Row],[max er]]","v":30},{"$f":"lcc[[#This Row],[Column1]]","v":""},{"$f":"lcc[[#This Row],[_1]]","v":""},{"$f":"lcc[[#This Row],[_2]]","v":""}]
[{"$f":"lcc[[#This Row],[speed]]","v":"constant"},{"$f":"lcc[[#This Row],[rated motor power]]","v":1.5},{"$f":"lcc[[#This Row],[doe]]","v":"IL"},{"$f":"lcc[[#This Row],[max er]]","v":20},{"$f":"lcc[[#This Row],[Column1]]","v":""},{"$f":"lcc[[#This Row],[_1]]","v":""},{"$f":"lcc[[#This Row],[_2]]","v":""}]
[{"$f":"lcc[[#This Row],[speed]]","v":"constant"},{"$f":"lcc[[#This Row],[rated motor power]]","v":1.5},{"$f":"lcc[[#This Row],[doe]]","v":"RSV"},{"$f":"lcc[[#This Row],[max er]]","v":12},{"$f":"lcc[[#This Row],[Column1]]","v":""},{"$f":"lcc[[#This Row],[_1]]","v":""},{"$f":"lcc[[#This Row],[_2]]","v":""}]
{"$rows_left_out":613}
{"sheet":"Cost of Electricity","index":12,"n_rows":62,"n_cols":2,"rows_kept":62,"cut":false,"hidden":true,"merged":[]}
["Cost of Electricity"]
[]
["This tab holds the average cost of electricity for each state in the USA, as well as the District of Columbia."]
["If the state the pump is located in is unavailable a national average is used."]
[]
[]
["State","Cost of electricity"]
[null,0.10529999999999999]
["Unknown",0.10529999999999999]
["Alabama",9.6300000000000011E-2]
{"$rows_left_out":52}